program: Orca
programVersion: 4.2.1
elementType: S F F F O O O O O N N N N N C C C C C C C C C C C C C H H H H H H H H H H H H
charge: 0
multiplicity: 1
keywords: wb97x-d3
keywords: def2-TZVPP
keywords: def2/J RIJCOSX GRIDX6 NOFINALGRIDX
keywords: grid4 nofinalgrid
keywords: scfconv7
keywords: smallprint printgap noloewdin
keywords: NOSOSCF
formula: C13H12F3N5O5S
InChI: InChI=1S/C13H12F3N5O5S/c1-25-8-6-9(26-2)19-11(18-8)20-12(22)21-27(23,24)10-7(13(14,15)16)4-3-5-17-10/h3-6,20-21H,1-2H3
39 atoms
S  -1.474409 1.231695 -0.676413
F  -4.141437 1.567429 0.460913
F  -5.054914 0.291376 1.921802
F  -3.297125 1.407989 2.437394
O  -1.305598 2.225408 0.364596
O  -2.344262 1.468733 -1.803266
O  -0.40359 -0.273544 -3.108451
O  5.698865 -1.843629 -0.630131
O  3.214269 1.232916 1.801191
N  0.055898 0.909935 -1.199021
N  -1.198064 -1.331966 -0.237091
N  1.634989 -0.48235 -2.17363
N  3.667166 -1.158112 -1.40881
N  2.411163 0.402243 -0.167988
C  -1.958716 -0.324607 0.117253
C  -3.023751 -0.433669 1.009032
C  -3.262308 -1.695496 1.539057
C  -3.880335 0.7183 1.455328
C  -2.464829 -2.761557 1.163499
C  0.35495 0.02477 -2.219168
C  -1.43941 -2.534243 0.26494
C  2.606699 -0.401637 -1.199641
C  4.615806 -1.104114 -0.484745
C  3.369254 0.447513 0.752645
C  4.52788 -0.30269 0.648443
C  5.806283 -2.692279 -1.769874
C  2.021878 2.005548 1.916157
H  0.803079 1.026365 -0.492808
H  -4.064264 -1.858181 2.245399
H  -2.637381 -3.749969 1.563608
H  -0.788131 -3.335441 -0.059372
H  1.859479 -1.098634 -2.944029
H  5.307769 -0.267798 1.395028
H  4.996018 -3.420268 -1.809451
H  5.821487 -2.121221 -2.698379
H  6.751966 -3.215747 -1.656387
H  2.127514 2.573692 2.836456
H  1.137402 1.372258 1.996456
H  1.90779 2.700516 1.083638
elementType: S F O N C H
totalener: -1850.43791468 hartree
nucrepener: 2905.94359505 hartree
electener: -4756.38150973 hartree
oneelecener: -8323.22972627 hartree
twoeener: 3566.84821654 hartree
cpcmener: -0.04269426 hartree
kineticenergy: 1844.16664454 hartree
xcener: -147.912669737897 hartree
chargesum: -0.0000000
charge: 0.860445 -0.165310 -0.172106 -0.163599 -0.489886 -0.467111 -0.429484 -0.291016 -0.288976 -0.208045 -0.308992 -0.140077 -0.422645 -0.423816 0.144120 -0.113888 -0.065166 0.537007 -0.137610 0.331550 0.046764 0.366366 0.417134 0.422912 -0.325102 -0.114806 -0.120424 0.195515 0.154531 0.169530 0.151335 0.188726 0.144652 0.112481 0.114113 0.131061 0.137451 0.103610 0.118755
qa: 0.8604 -0.1653 -0.1721 -0.1636 -0.4899 -0.4671 -0.4295 -0.2910 -0.2890 -0.2080 -0.3090 -0.1401 -0.4226 -0.4238 0.1441 -0.1139 -0.0652 0.5370 -0.1376 0.3315 0.0468 0.3664 0.4171 0.4229 -0.3251 -0.1148 -0.1204 0.1955 0.1545 0.1695 0.1513 0.1887 0.1447 0.1125 0.1141 0.1311 0.1375 0.1036 0.1188
va: 5.8161 1.1396 1.1349 1.1327 1.9875 2.0094 2.0845 2.1321 2.1426 3.0636 3.0099 3.1742 2.9687 2.9862 3.9056 3.7994 3.9522 4.4423 3.9266 4.4650 4.0094 4.2540 4.0225 3.9835 3.9266 3.8491 3.8461 1.0984 1.0035 0.9872 0.9926 1.0186 1.0166 0.9960 0.9952 0.9936 0.9960 0.9977 0.9903
dispcorr: -0.020909697 hartree
energy: -1850.458824378833
dipole: 33.59860 -31.30308 2.29552 -13.78333 10.30968 -3.47366 -2.79912 4.90615 2.10703
magnitude: 4.66640 au
magnitude: 11.86104 debye
