program: Gaussian 09
title: 000073942
version: EM64L-G09RevD.01
frameworkgroup: C1[X(C9H9NO2)]
method: RPBEPBE
basis: SDD
operation: Freq
keyword: #pfreq=noraman
keyword: PBEPBE/SDD
title: #p freq=noraman PBEPBE/SDD
converged: NO YES NO NO
title: Mulliken charges:
elementType: O O N C C C C C C C C C H H H H H H H H H
charge: -0.246034 -0.215645 -0.438561 0.495477 -0.337186 -0.432478 0.400394 -0.372376 -0.344823 0.219084 -0.796957 -0.211664 0.313313 0.223850 0.236436 0.273251 0.314351 0.241397 0.272887 0.238789 0.166497
chargesum: 0.00000
title: Mulliken charges with hydrogens summed into heavy atoms:
elementType: O O N C C C C C C C C C
charge: -0.246034 -0.215645 -0.124210 0.495477 -0.023874 -0.208628 0.400394 -0.135940 -0.071572 0.219084 -0.043884 -0.045168
polarizability: 2.03549950e+02 -5.97726570e-01 1.09429746e+02 2.05331229e-02 -1.14455281e-02 4.87384936e+01
1716.lowfreq: -76.5064 -13.1587 -11.1116 -0.0007 0.0003 0.0004 2.5074 55.1141 71.9743
frequency: -76.4825 55.1008 71.9547 129.0938 129.6862 204.2078 204.4890 296.0732 336.7853 343.8534 420.3962 449.2614 517.3100 561.0314 582.5148 623.5139 655.3814 670.3018 736.3607 787.1174 842.0909 844.8278 861.9550 929.7028 967.9073 984.6721 994.9456 1004.9971 1005.3241 1032.6163 1120.2309 1178.3457 1218.8864 1227.0466 1265.5499 1307.1242 1355.8241 1378.1949 1395.0430 1425.0213 1447.7832 1468.3306 1491.8268 1508.3692 1581.0938 1605.9560 1626.8362 1641.3349 2874.1809 2991.3021 3076.2531 3117.1307 3126.6607 3140.7061 3158.0102 3199.1440 3520.3394
redmass: 1.0558 6.5729 4.2678 5.6483 4.9649 6.9341 2.9661 4.0629 3.3384 5.9016 2.9205 4.7359 2.5669 5.0756 2.8948 6.8946 1.1902 5.7087 3.2709 4.4996 1.4488 5.1177 1.3502 6.3999 1.4653 1.6944 1.4701 2.6133 1.4808 1.6719 1.3447 1.1909 3.4255 2.2227 1.9781 1.5495 2.3218 1.2341 1.6780 4.3621 1.1666 1.0470 1.9372 2.9203 5.1391 6.1364 6.1863 5.5039 1.0847 1.0386 1.0983 1.0893 1.0907 1.0979 1.0952 1.0947 1.0764
irintensity: 0.0640 3.6515 9.9908 9.5773 3.2808 2.6323 7.9297 1.3628 1.6682 4.9359 0.4676 6.9952 35.5953 0.9086 1.2663 1.1727 63.2426 30.7522 0.1414 21.7924 50.7131 14.0518 41.5255 6.3559 8.4294 34.2153 6.9140 1.9977 0.1119 8.5960 19.9939 89.0333 84.8682 59.7394 65.0603 123.0806 111.2334 58.9213 42.4542 26.8766 76.8799 21.2710 328.5770 280.9785 17.7481 397.5632 5.1550 124.0027 131.6979 6.5761 13.4463 17.4405 8.0795 6.4603 4.8414 4.6126 14.6703
temp: 298.150 k
press: 1.00000 atm
elementType: 8 8 7 6 6 6 6 6 6 6 6 6 1 1 1 1 1 1 1 1 1
symmnumber: 1
zpe: 422820.1 jmol-1
zpe.correction: 0.161044 hartree
zpe.thermalcorrener: 0.171459 hartree
zpe.thermalcorrenthalpy: 0.172404 hartree
zpe.thermalcorrgfe: 0.124307 hartree
zpe.sumelectzpe: -552.706730 hartree
zpe.sumelectthermal: -552.696314 hartree
zpe.sumelectthermalent: -552.695370 hartree
zpe.sumelectthermalfe: -552.743466 hartree
dipole: 4.6512 -2.5676 0.0058
dipole: 5.3129
quadrupole: -83.8886 -63.8782 -72.2820
quadrupole: -18.1033 0.0218 -0.0025
quadrupole: -10.5390 9.4714 1.0676 -18.1033 0.0218 -0.0025
hfenergy: -552.8677732 hartree
pointgroup: C01 [X(C9H9N1O2)]
dipole: 1.8126893 -1.0408094 0.0017697 debye
dipolederiv: -0.7117623 0.0436219 -0.000014 -0.6104848 -0.8919815 0.0003906 -0.0023371 0.0001926 -0.3333114 -1.3293816 -0.0509138 0.0009512 -0.5421178 -0.4735511 0.0007018 -0.0006312 -0.0002576 -0.3413536 -2.2646441 -0.1505126 0.0000349 -0.3195213 -0.363352 -0.0008699 0.0002926 -0.0002081 -0.3228764 1.5119993 -0.0899142 -0.0010174 -0.4185504 0.1593982 0.0001218 -0.0019374 0.000157 0.1206316 -0.4367874 0.1181492 -0.0000399 0.4455888 -0.1518735 -0.000252 -0.0001725 -0.0001567 -0.1626627 -0.5819947 -0.0561162 0.0001232 -0.2640062 0.0766411 0.0001729 0.0003685 0.0001556 -0.2059454 -1.1584213 0.1111518 0.0005772 0.3552645 -0.208179 -0.0001055 0.0008424 -0.0000086 0.0006197 0.4473011 -0.0977112 -0.000505 0.0969988 0.1253801 -0.00018 0.0001299 0.0000006 -0.1421499 0.301485 0.0277557 -0.0003926 -0.2167917 0.0867266 0.0001533 -0.0000769 -0.0001268 -0.0929354 2.0390842 0.1041263 0.0021655 1.0183404 1.1458021 -0.0010475 0.0092947 -0.0020276 0.1768926 -0.4206364 0.1449894 -0.0006429 0.2811471 -0.1318819 0.0040201 -0.0123533 0.0067243 0.0530262 2.0266344 -0.063373 -0.0012547 -0.0074447 0.7338294 -0.0007104 -0.0002316 -0.0004058 0.101809 0.1374249 -0.058065 0.0001876 -0.029694 0.0812481 0.0000386 0.0000778 0.0001297 0.1835162 0.0242681 0.1062286 0.0001555 0.0887684 -0.0798608 -0.0000415 0.0000051 -0.0001212 0.1647376 0.0596303 0.0776607 0.0000671 0.0536504 -0.0620243 -0.0000225 0.0000952 -0.0000084 0.1509715 0.0573925 -0.0841635 0.0001022 -0.0376349 0.0314723 0.0000482 0.0001258 0.0000658 0.1543561 0.1653526 -0.0221669 0.0000558 0.003405 0.0986376 -0.0001721 0.0007486 -0.0005461 0.3049564 0.0590378 0.0021325 0.0318623 0.0312112 0.0435708 0.1001973 -0.0172764 0.105657 -0.0310835 -0.007722 -0.0464524 0.0034703 -0.1161419 0.0305242 0.0041017 0.0076512 0.0019752 0.1336563 0.0597258 -0.0034141 -0.0358771 0.0294539 0.0302117 -0.1067279 0.0158018 -0.1119583 -0.0208292 0.0220139 -0.0130133 -0.000009 0.1585593 -0.280738 0.0001833 -0.0004173 0.0007675 0.1079744 unknown
polarizability: 203.5032397|-2.1797756|109.4764551|-0.0246314|-0.0118132|48.7384951 unknown
InChI: InChI=1S/C9H9NO2/c1-7(12)10-9-4-2-8(6-11)3-5-9/h2-6,10H,1H3
charge 0 multiplicity 1
21 atoms
O  3.06774 1.375847 -0.001614
O  -4.534002 -0.293531 0.001169
N  1.986611 -0.710151 -0.00319
C  0.618023 -0.340614 -0.0019
C  0.180186 1.013452 -0.001451
C  -0.343086 -1.396975 -0.00106
C  -2.161249 0.23976 0.00094
C  -1.200237 1.284033 -0.000027
C  -1.713322 -1.110358 0.000349
C  3.123608 0.114296 -0.002277
C  4.440534 -0.658814 0.000978
C  -3.604472 0.560654 0.00252
H  0.920776 1.814023 -0.002408
H  -0.001506 -2.440141 -0.001392
H  -1.541531 2.326958 0.000267
H  -2.463304 -1.908393 0.001115
H  2.166739 -1.717441 -0.003879
H  4.539983 -1.275892 0.912959
H  5.270111 0.061106 -0.028199
H  4.51923 -1.326838 -0.876352
H  -3.840231 1.655219 0.000453
