program: Orca
programVersion: 4.2.1
elementType: S F F F O O O O O N N N N N C C C C C C C C C C C C C H H H H H H H H H H H H
charge: 0
multiplicity: 1
keywords: wb97x-d3
keywords: def2-TZVPP
keywords: def2/J RIJCOSX GRIDX6 NOFINALGRIDX
keywords: grid4 nofinalgrid
keywords: scfconv7
keywords: smallprint printgap noloewdin
keywords: NOSOSCF
formula: C13H12F3N5O5S
InChI: InChI=1S/C13H12F3N5O5S/c1-25-8-6-9(26-2)19-11(18-8)20-12(22)21-27(23,24)10-7(13(14,15)16)4-3-5-17-10/h3-6,20-21H,1-2H3
39 atoms
S  -1.162637 -1.352538 -0.962476
F  -3.560422 -2.678544 0.037668
F  -2.642578 -2.831783 1.981503
F  -4.661381 -2.130553 1.793825
O  -2.028275 -1.511884 -2.10591
O  -0.660377 -2.500392 -0.234794
O  -0.723519 0.978498 -2.880959
O  3.61231 -0.788635 1.309539
O  4.976538 3.403445 -0.14433
N  0.185177 -0.502577 -1.38542
N  -1.520834 0.979219 0.169775
N  1.265003 1.473273 -1.947244
N  2.431096 0.310906 -0.305621
N  3.119716 2.437196 -1.051914
C  -1.969323 -0.251231 0.230757
C  -2.958125 -0.672408 1.117766
C  -3.473115 0.290749 1.976265
C  -3.454228 -2.087224 1.228059
C  -3.005493 1.591079 1.911176
C  0.159971 0.669462 -2.119946
C  -2.024567 1.893928 0.985694
C  2.313782 1.392729 -1.056925
C  3.456706 0.270999 0.539386
C  4.138116 2.38634 -0.20497
C  4.371301 1.305433 0.638379
C  2.673779 -1.857491 1.214328
C  4.745964 4.537666 -0.975763
H  0.996978 -0.602129 -0.751882
H  -4.236652 0.038788 2.698894
H  -3.395837 2.353321 2.56959
H  -1.626329 2.89629 0.896017
H  1.250991 2.31545 -2.507567
H  5.205875 1.274689 1.323561
H  3.012992 -2.609959 1.921276
H  1.669759 -1.539336 1.498062
H  2.658111 -2.295038 0.215547
H  3.784785 5.005617 -0.762034
H  4.792478 4.27997 -2.033883
H  5.54406 5.237735 -0.742703
elementType: S F O N C H
totalener: -1850.43799045 hartree
nucrepener: 2903.54279815 hartree
electener: -4753.98078860 hartree
oneelecener: -8318.46053600 hartree
twoeener: 3564.47974740 hartree
cpcmener: -0.04267536 hartree
kineticenergy: 1844.16554439 hartree
xcener: -147.912560617108 hartree
chargesum: -0.0000000
charge: 0.860967 -0.165252 -0.163897 -0.171956 -0.466679 -0.491164 -0.429654 -0.289092 -0.290911 -0.208604 -0.310953 -0.140046 -0.423946 -0.423008 0.146364 -0.114155 -0.065253 0.537295 -0.136627 0.332449 0.046267 0.366684 0.422761 0.415982 -0.324793 -0.121422 -0.115429 0.195482 0.154410 0.169081 0.151474 0.189109 0.145196 0.137510 0.104638 0.118535 0.113406 0.113905 0.131328
qa: 0.8610 -0.1653 -0.1639 -0.1720 -0.4667 -0.4912 -0.4297 -0.2891 -0.2909 -0.2086 -0.3110 -0.1400 -0.4239 -0.4230 0.1464 -0.1142 -0.0653 0.5373 -0.1366 0.3324 0.0463 0.3667 0.4228 0.4160 -0.3248 -0.1214 -0.1154 0.1955 0.1544 0.1691 0.1515 0.1891 0.1452 0.1375 0.1046 0.1185 0.1134 0.1139 0.1313
va: 5.8150 1.1398 1.1324 1.1350 2.0099 1.9861 2.0841 2.1424 2.1318 3.0638 3.0107 3.1749 2.9853 2.9673 3.9055 3.7993 3.9525 4.4409 3.9272 4.4647 4.0103 4.2538 3.9844 4.0241 3.9286 3.8454 3.8486 1.0977 1.0035 0.9874 0.9926 1.0185 1.0164 0.9960 0.9977 0.9906 0.9960 0.9954 0.9935
dispcorr: -0.020834473 hartree
energy: -1850.458824926855
dipole: 28.74358 -27.25703 1.48655 22.46562 -19.19153 3.27409 0.81199 2.13969 2.95168
magnitude: 4.65208 au
magnitude: 11.82466 debye
