program: Orca
programVersion: 4.2.1
elementType: S F F F O O O O O N N N N N C C C C C C C C C C C C C H H H H H H H H H H H H
charge: 0
multiplicity: 1
keywords: wb97x-d3
keywords: def2-TZVPP
keywords: def2/J RIJCOSX GRIDX6 NOFINALGRIDX
keywords: grid4 nofinalgrid
keywords: scfconv7
keywords: smallprint printgap noloewdin
keywords: NOSOSCF
formula: C13H12F3N5O5S
InChI: InChI=1S/C13H12F3N5O5S/c1-25-8-6-9(26-2)19-11(18-8)20-12(22)21-27(23,24)10-7(13(14,15)16)4-3-5-17-10/h3-6,20-21H,1-2H3
39 atoms
S  -1.453601 1.207875 -0.676961
F  -4.120306 1.639877 0.419465
F  -5.104442 0.398429 1.863886
F  -3.320163 1.456471 2.412058
O  -1.273175 2.205555 0.357795
O  -2.297869 1.459956 -1.819265
O  -0.386817 -0.356696 -3.072285
O  5.796655 -1.760447 -0.676762
O  3.22342 1.18153 1.827394
N  0.075558 0.839704 -1.171834
N  -1.259271 -1.358932 -0.210997
N  1.658025 -0.546318 -2.146234
N  3.726674 -1.151029 -1.418886
N  2.429812 0.346385 -0.14323
C  -1.995954 -0.326717 0.121398
C  -3.08041 -0.396516 0.993367
C  -3.368668 -1.646835 1.525969
C  -3.906996 0.784639 1.419577
C  -2.597323 -2.73926 1.173103
C  0.374143 -0.046768 -2.188884
C  -1.546905 -2.549276 0.295024
C  2.641152 -0.437675 -1.186977
C  4.685043 -1.069915 -0.506849
C  3.396385 0.41634 0.766807
C  4.58112 -0.287563 0.638431
C  5.933289 -2.574193 -1.838302
C  1.999846 1.899227 1.968145
H  0.819896 0.955459 -0.462481
H  -4.189391 -1.779435 2.216722
H  -2.80874 -3.719346 1.574854
H  -0.914303 -3.372213 -0.010969
H  1.887456 -1.156366 -2.920087
H  5.369599 -0.232206 1.374636
H  5.91363 -1.979943 -2.751916
H  6.903529 -3.054777 -1.74523
H  5.158548 -3.338725 -1.890719
H  1.145146 1.226389 2.046255
H  1.847244 2.603395 1.149753
H  2.091026 2.455714 2.897078
elementType: S F O N C H
totalener: -1850.43821561 hartree
nucrepener: 2900.71215250 hartree
electener: -4751.15036812 hartree
oneelecener: -8312.81365630 hartree
twoeener: 3561.66328819 hartree
cpcmener: -0.04255474 hartree
kineticenergy: 1844.17148483 hartree
xcener: -147.913886546603 hartree
chargesum: 0.0000000
charge: 0.860338 -0.165165 -0.172340 -0.163792 -0.490357 -0.467152 -0.431368 -0.290925 -0.288964 -0.205778 -0.308919 -0.139001 -0.423196 -0.423684 0.143111 -0.114006 -0.065236 0.537268 -0.138115 0.333202 0.047251 0.367453 0.416497 0.422108 -0.324106 -0.114944 -0.121039 0.194894 0.154691 0.169532 0.151162 0.188519 0.144824 0.114010 0.131062 0.112492 0.105485 0.116841 0.137348
qa: 0.8603 -0.1652 -0.1723 -0.1638 -0.4904 -0.4672 -0.4314 -0.2909 -0.2890 -0.2058 -0.3089 -0.1390 -0.4232 -0.4237 0.1431 -0.1140 -0.0652 0.5373 -0.1381 0.3332 0.0473 0.3675 0.4165 0.4221 -0.3241 -0.1149 -0.1210 0.1949 0.1547 0.1695 0.1512 0.1885 0.1448 0.1140 0.1311 0.1125 0.1055 0.1168 0.1373
va: 5.8146 1.1398 1.1346 1.1325 1.9872 2.0095 2.0826 2.1321 2.1430 3.0656 3.0096 3.1746 2.9697 2.9871 3.9069 3.7991 3.9526 4.4417 3.9257 4.4612 4.0104 4.2550 4.0232 3.9843 3.9255 3.8495 3.8474 1.0996 1.0035 0.9872 0.9926 1.0188 1.0165 0.9953 0.9936 0.9959 0.9960 0.9910 0.9963
dispcorr: -0.020809167 hartree
energy: -1850.459024779188
dipole: 33.61077 -31.41815 2.19262 -14.00042 10.56748 -3.43294 -2.63939 4.75242 2.11303
magnitude: 4.58885 au
magnitude: 11.66394 debye
