program: Orca
programVersion: 4.2.1
elementType: S F F F O O O O O N N N N N C C C C C C C C C C C C C H H H H H H H H H H H H
charge: 0
multiplicity: 1
keywords: wb97x-d3
keywords: def2-TZVPP
keywords: def2/J RIJCOSX GRIDX6 NOFINALGRIDX
keywords: grid4 nofinalgrid
keywords: scfconv7
keywords: smallprint printgap noloewdin
keywords: NOSOSCF
formula: C13H12F3N5O5S
InChI: InChI=1S/C13H12F3N5O5S/c1-25-8-6-9(26-2)19-11(18-8)20-12(22)21-27(23,24)10-7(13(14,15)16)4-3-5-17-10/h3-6,20-21H,1-2H3
39 atoms
S  -1.340651 0.96265 -0.318893
F  -3.770309 1.367654 2.335069
F  -4.03646 1.894572 0.264775
F  -5.552916 0.782354 1.291279
O  -1.143529 1.799895 0.847038
O  -1.913986 1.493798 -1.531588
O  -0.310085 -0.666292 -2.634453
O  6.268397 -1.175592 -1.091741
O  3.628322 1.167036 1.920064
N  0.151619 0.334098 -0.634121
N  -1.729564 -1.619496 -0.073679
N  1.800056 -0.74978 -1.852685
N  4.027746 -0.967764 -1.471034
N  2.686615 0.210076 0.071208
C  -2.316422 -0.477169 0.185825
C  -3.577854 -0.367594 0.772071
C  -4.228553 -1.557984 1.070877
C  -4.232639 0.929185 1.16113
C  -3.618813 -2.766038 0.784811
C  0.477319 -0.375204 -1.766604
C  -2.359097 -2.749426 0.216562
C  2.878223 -0.48385 -1.037975
C  5.088171 -0.718503 -0.716983
C  3.761599 0.462554 0.812376
C  5.024045 0.013866 0.463125
C  6.365054 -1.934131 -2.293591
C  2.342462 1.671831 2.270173
H  0.897496 0.487786 0.059453
H  -5.208547 -1.554286 1.527087
H  -4.112268 -3.701293 1.006029
H  -1.835726 -3.668354 -0.014292
H  2.021714 -1.276667 -2.687412
H  5.897609 0.219328 1.0645
H  6.046317 -1.359101 -3.163075
H  7.41758 -2.184693 -2.397825
H  5.782129 -2.85383 -2.238335
H  1.629255 0.868048 2.457159
H  1.952329 2.346419 1.50734
H  2.488028 2.23091 3.190762
elementType: S F O N C H
totalener: -1850.43861602 hartree
nucrepener: 2853.72668953 hartree
electener: -4704.16530555 hartree
oneelecener: -8219.31351545 hartree
twoeener: 3515.14820990 hartree
cpcmener: -0.04093861 hartree
kineticenergy: 1844.15703934 hartree
xcener: -147.910976078299 hartree
chargesum: -0.0000000
charge: 0.852324 -0.164988 -0.163813 -0.172716 -0.496339 -0.465448 -0.442150 -0.291751 -0.289391 -0.196802 -0.310399 -0.143388 -0.427859 -0.434081 0.160881 -0.130750 -0.063109 0.534283 -0.141440 0.354676 0.049326 0.376406 0.412976 0.418172 -0.322104 -0.116012 -0.126440 0.210212 0.154039 0.169144 0.152082 0.188051 0.144952 0.112658 0.131811 0.113481 0.113532 0.112892 0.137083
qa: 0.8523 -0.1650 -0.1638 -0.1727 -0.4963 -0.4654 -0.4422 -0.2918 -0.2894 -0.1968 -0.3104 -0.1434 -0.4279 -0.4341 0.1609 -0.1308 -0.0631 0.5343 -0.1414 0.3547 0.0493 0.3764 0.4130 0.4182 -0.3221 -0.1160 -0.1264 0.2102 0.1540 0.1691 0.1521 0.1881 0.1450 0.1127 0.1318 0.1135 0.1135 0.1129 0.1371
va: 5.7949 1.1309 1.1417 1.1343 1.9838 2.0114 2.0740 2.1307 2.1400 3.0900 3.0186 3.1723 2.9666 2.9782 3.9198 3.8204 3.9497 4.4395 3.9216 4.4433 4.0091 4.2458 4.0276 3.9928 3.9265 3.8498 3.8446 1.0727 1.0045 0.9873 0.9918 1.0201 1.0164 0.9959 0.9932 0.9955 0.9912 0.9960 0.9965
dispcorr: -0.019759020 hartree
energy: -1850.458375038120
dipole: 34.20604 -32.80324 1.40280 -13.54413 10.37699 -3.16714 -3.18988 4.62806 1.43818
magnitude: 3.75059 au
magnitude: 9.53325 debye
