program: Orca
programVersion: 4.2.1
elementType: S F F F O O O O O N N N N N C C C C C C C C C C C C C H H H H H H H H H H H H
charge: 0
multiplicity: 1
keywords: wb97x-d3
keywords: def2-TZVPP
keywords: def2/J RIJCOSX GRIDX6 NOFINALGRIDX
keywords: grid4 nofinalgrid
keywords: scfconv7
keywords: smallprint printgap noloewdin
keywords: NOSOSCF
formula: C13H12F3N5O5S
InChI: InChI=1S/C13H12F3N5O5S/c1-25-8-6-9(26-2)19-11(18-8)20-12(22)21-27(23,24)10-7(13(14,15)16)4-3-5-17-10/h3-6,20-21H,1-2H3
39 atoms
S  -1.113324 -0.166101 1.269235
F  -5.490415 0.92204 1.284481
F  -3.713002 0.495052 2.401709
F  -3.802687 2.2384 1.140065
O  -1.40185 -1.160433 2.276375
O  -1.006966 1.23837 1.61414
O  0.114456 -2.788105 0.374759
O  6.167285 -0.635263 -1.802776
O  3.234005 2.625287 -0.282828
N  0.312137 -0.515274 0.523354
N  -1.884107 -0.95503 -1.106136
N  2.013696 -1.81707 -0.353184
N  4.084105 -1.229326 -1.086046
N  2.59762 0.432668 -0.322032
C  -2.337996 -0.324682 -0.051163
C  -3.640235 0.161793 0.064428
C  -4.483282 -0.063845 -1.015946
C  -4.158253 0.955358 1.232728
C  -4.012846 -0.741566 -2.126296
C  0.751814 -1.778074 0.200263
C  -2.697747 -1.16639 -2.130984
C  2.930581 -0.817901 -0.594178
C  4.990452 -0.29005 -1.315298
C  3.51727 1.364991 -0.551361
C  4.767468 1.058901 -1.060926
C  6.428094 -2.011205 -2.067406
C  1.957309 2.94524 0.264739
H  0.942033 0.270952 0.295532
H  -5.506397 0.284316 -1.003785
H  -4.656567 -0.930781 -2.972876
H  -2.281805 -1.691983 -2.980909
H  2.330943 -2.749413 -0.584786
H  5.516908 1.814568 -1.245614
H  7.44961 -2.048943 -2.436761
H  6.350347 -2.618512 -1.165645
H  5.756891 -2.409986 -2.828293
H  1.964497 4.02117 0.417864
H  1.795442 2.455304 1.225454
H  1.148959 2.694397 -0.423201
elementType: S F O N C H
totalener: -1850.43854649 hartree
nucrepener: 2859.10063804 hartree
electener: -4709.53918452 hartree
oneelecener: -8230.04133540 hartree
twoeener: 3520.50215087 hartree
cpcmener: -0.04116054 hartree
kineticenergy: 1844.16413680 hartree
xcener: -147.913055541670 hartree
chargesum: -0.0000000
charge: 0.853423 -0.172132 -0.164899 -0.164476 -0.468874 -0.497628 -0.440039 -0.291635 -0.289028 -0.197607 -0.309562 -0.143768 -0.426635 -0.428994 0.156234 -0.129353 -0.063274 0.536765 -0.140244 0.354955 0.050317 0.372552 0.414976 0.420080 -0.323642 -0.115043 -0.126429 0.205482 0.153623 0.168430 0.151901 0.188184 0.144851 0.131188 0.113075 0.113747 0.138234 0.111572 0.113678
qa: 0.8534 -0.1721 -0.1649 -0.1645 -0.4689 -0.4976 -0.4400 -0.2916 -0.2890 -0.1976 -0.3096 -0.1438 -0.4266 -0.4290 0.1562 -0.1294 -0.0633 0.5368 -0.1402 0.3550 0.0503 0.3726 0.4150 0.4201 -0.3236 -0.1150 -0.1264 0.2055 0.1536 0.1684 0.1519 0.1882 0.1449 0.1312 0.1131 0.1137 0.1382 0.1116 0.1137
va: 5.7940 1.1349 1.1403 1.1316 2.0080 1.9818 2.0774 2.1313 2.1413 3.0830 3.0217 3.1722 2.9679 2.9826 3.9254 3.8167 3.9487 4.4394 3.9219 4.4440 4.0065 4.2514 4.0266 3.9892 3.9286 3.8493 3.8440 1.0835 1.0045 0.9875 0.9917 1.0198 1.0165 0.9935 0.9960 0.9953 0.9961 0.9966 0.9915
dispcorr: -0.019884395 hartree
energy: -1850.458430882685
dipole: 31.75411 -31.03782 0.71629 -3.97370 4.36181 0.38810 -17.56938 13.87268 -3.69670
magnitude: 3.78540 au
magnitude: 9.62173 debye
