program: Orca
programVersion: 4.2.1
elementType: S F F F O O O O O N N N N N C C C C C C C C C C C C C H H H H H H H H H H H H
charge: 0
multiplicity: 1
keywords: wb97x-d3
keywords: def2-TZVPP
keywords: def2/J RIJCOSX GRIDX6 NOFINALGRIDX
keywords: grid4 nofinalgrid
keywords: scfconv7
keywords: smallprint printgap noloewdin
keywords: NOSOSCF
formula: C13H12F3N5O5S
InChI: InChI=1S/C13H12F3N5O5S/c1-25-8-6-9(26-2)19-11(18-8)20-12(22)21-27(23,24)10-7(13(14,15)16)4-3-5-17-10/h3-6,20-21H,1-2H3
39 atoms
S  -1.826009 1.580069 -0.134008
F  -1.956116 -2.393494 2.220383
F  -0.614284 -1.886668 0.626769
F  -1.165364 -0.409326 2.09632
O  -1.738973 2.138695 1.199206
O  -2.183485 2.432428 -1.24179
O  -0.939132 -0.091372 -2.368278
O  3.22924 1.641269 1.986789
O  5.669449 -0.908038 -1.02976
N  -0.349106 0.875334 -0.403417
N  -4.020795 0.462131 -0.891324
N  1.211564 -0.257374 -1.695104
N  2.198689 0.699733 0.179495
N  3.435535 -0.585568 -1.362597
C  -2.972127 0.173943 -0.160422
C  -2.803629 -1.039614 0.508329
C  -3.797368 -1.992551 0.313187
C  -1.62856 -1.421952 1.367222
C  -4.893081 -1.699293 -0.476694
C  -0.084962 0.167784 -1.548662
C  -4.973515 -0.443467 -1.048241
C  2.325679 -0.031281 -0.914928
C  3.302206 0.909536 0.891336
C  4.526626 -0.375922 -0.639662
C  4.530181 0.386452 0.523264
C  1.970865 2.187199 2.372943
C  5.688262 -1.714214 -2.20496
H  0.438451 1.081981 0.229334
H  -3.728597 -2.966754 0.775866
H  -5.67176 -2.430357 -0.637355
H  -5.821305 -0.156452 -1.656799
H  1.377485 -0.808402 -2.527734
H  5.42649 0.554448 1.102154
H  1.574838 2.865615 1.616391
H  1.241709 1.406327 2.593441
H  2.162049 2.751765 3.281593
H  6.72071 -2.031794 -2.325355
H  5.380705 -1.152126 -3.086744
H  5.052593 -2.593656 -2.09995
elementType: S F O N C H
totalener: -1850.43724043 hartree
nucrepener: 2954.14769440 hartree
electener: -4804.58493483 hartree
oneelecener: -8419.86529639 hartree
twoeener: 3615.28036156 hartree
cpcmener: -0.04139659 hartree
kineticenergy: 1844.15687945 hartree
xcener: -147.909841893606 hartree
chargesum: -0.0000000
charge: 0.867676 -0.169468 -0.168640 -0.166657 -0.492384 -0.474769 -0.445737 -0.288167 -0.290905 -0.232101 -0.289664 -0.130466 -0.429286 -0.426040 0.093312 -0.109755 -0.067293 0.557776 -0.136513 0.343092 0.057367 0.373312 0.418612 0.413935 -0.320231 -0.123110 -0.116041 0.220213 0.151522 0.167177 0.157542 0.190649 0.145319 0.113784 0.108318 0.138820 0.132173 0.112795 0.113833
qa: 0.8677 -0.1695 -0.1686 -0.1667 -0.4924 -0.4748 -0.4457 -0.2882 -0.2909 -0.2321 -0.2897 -0.1305 -0.4293 -0.4260 0.0933 -0.1098 -0.0673 0.5578 -0.1365 0.3431 0.0574 0.3733 0.4186 0.4139 -0.3202 -0.1231 -0.1160 0.2202 0.1515 0.1672 0.1575 0.1906 0.1453 0.1138 0.1083 0.1388 0.1322 0.1128 0.1138
va: 5.8069 1.1404 1.1176 1.1413 1.9842 2.0351 2.0709 2.1426 2.1328 3.0535 3.0597 3.1846 2.9678 2.9707 3.9621 3.7682 3.9598 4.3954 3.9174 4.4330 3.9937 4.2396 3.9980 4.0286 3.9287 3.8492 3.8492 1.0572 1.0063 0.9882 0.9912 1.0180 1.0163 0.9928 0.9961 0.9956 0.9933 0.9958 0.9956
dispcorr: -0.021617268 hartree
energy: -1850.458857697430
dipole: 16.90109 -16.01323 0.88786 1.13089 -4.01339 -2.88250 -7.03861 7.43594 0.39733
magnitude: 3.04220 au
magnitude: 7.73266 debye
