program: Orca
programVersion: 4.2.1
elementType: S F F F O O O O O N N N N N C C C C C C C C C C C C C H H H H H H H H H H H H
charge: 0
multiplicity: 1
keywords: wb97x-d3
keywords: def2-TZVPP
keywords: def2/J RIJCOSX GRIDX6 NOFINALGRIDX
keywords: grid4 nofinalgrid
keywords: scfconv7
keywords: smallprint printgap noloewdin
keywords: NOSOSCF
formula: C13H12F3N5O5S
InChI: InChI=1S/C13H12F3N5O5S/c1-25-8-6-9(26-2)19-11(18-8)20-12(22)21-27(23,24)10-7(13(14,15)16)4-3-5-17-10/h3-6,20-21H,1-2H3
39 atoms
S  -1.345084 -0.856654 -1.838263
F  -0.81032 -2.069735 0.923803
F  -0.93179 -0.10815 1.809598
F  -2.039696 -1.742757 2.644359
O  -1.671967 -0.215326 -3.088626
O  -0.873045 -2.225835 -1.838071
O  -1.341075 1.947139 -0.990987
O  3.83971 -1.492477 -0.176791
O  4.917143 2.681802 1.545628
N  -0.174031 0.003328 -1.039896
N  -3.854945 -0.398724 -1.478512
N  0.771567 1.944797 -0.189721
N  2.292753 0.187242 -0.181058
N  2.839362 2.313839 0.678356
C  -2.795842 -0.686722 -0.762937
C  -2.819159 -0.855031 0.622654
C  -4.041067 -0.6333 1.248198
C  -1.641042 -1.199315 1.493486
C  -5.154562 -0.304818 0.497942
C  -0.316955 1.340132 -0.766629
C  -5.019051 -0.217741 -0.874698
C  2.02161 1.447726 0.112213
C  3.516393 -0.245434 0.108154
C  4.052805 1.867203 0.970672
C  4.468177 0.568374 0.698689
C  2.865192 -2.340589 -0.778695
C  4.506567 4.00968 1.861254
H  0.740041 -0.434155 -0.849855
H  -4.136544 -0.716187 2.321412
H  -6.108868 -0.127458 0.971768
H  -5.864706 0.014242 -1.509161
H  0.631002 2.919916 0.042368
H  5.461166 0.216109 0.936846
H  2.534392 -1.956778 -1.744618
H  3.361718 -3.29475 -0.933926
H  2.006641 -2.495935 -0.123983
H  5.372411 4.482846 2.317004
H  3.679002 4.016948 2.570877
H  4.220228 4.568035 0.96999
elementType: S F O N C H
totalener: -1850.43712307 hartree
nucrepener: 2957.39589620 hartree
electener: -4807.83301928 hartree
oneelecener: -8426.33591505 hartree
twoeener: 3618.50289577 hartree
cpcmener: -0.04143665 hartree
kineticenergy: 1844.15844384 hartree
xcener: -147.910212571636 hartree
chargesum: 0.0000000
charge: 0.866395 -0.166865 -0.168722 -0.169281 -0.474652 -0.492148 -0.444621 -0.288471 -0.290843 -0.232861 -0.289867 -0.130598 -0.429197 -0.426115 0.094924 -0.110753 -0.067564 0.558299 -0.138273 0.342197 0.058647 0.372673 0.419198 0.414497 -0.322921 -0.122859 -0.115637 0.222134 0.151177 0.168442 0.157018 0.190893 0.146083 0.113722 0.138989 0.108391 0.131119 0.114138 0.113308
qa: 0.8664 -0.1669 -0.1687 -0.1693 -0.4747 -0.4921 -0.4446 -0.2885 -0.2908 -0.2329 -0.2899 -0.1306 -0.4292 -0.4261 0.0949 -0.1108 -0.0676 0.5583 -0.1383 0.3422 0.0586 0.3727 0.4192 0.4145 -0.3229 -0.1229 -0.1156 0.2221 0.1512 0.1684 0.1570 0.1909 0.1461 0.1137 0.1390 0.1084 0.1311 0.1141 0.1133
va: 5.8088 1.1412 1.1173 1.1406 2.0352 1.9844 2.0719 2.1425 2.1328 3.0526 3.0599 3.1842 2.9660 2.9694 3.9591 3.7658 3.9600 4.3947 3.9174 4.4349 3.9933 4.2395 3.9956 4.0270 3.9289 3.8490 3.8489 1.0555 1.0061 0.9876 0.9913 1.0178 1.0160 0.9923 0.9953 0.9964 0.9937 0.9955 0.9956
dispcorr: -0.021690122 hartree
energy: -1850.458813194153
dipole: 14.85091 -14.69122 0.15970 10.30813 -9.52623 0.78190 -0.29927 3.27805 2.97878
magnitude: 3.08383 au
magnitude: 7.83847 debye
