program: Orca
programVersion: 4.2.1
elementType: S F F F O O O O O N N N N N C C C C C C C C C C C C C H H H H H H H H H H H H
charge: 0
multiplicity: 1
keywords: wb97x-d3
keywords: def2-TZVPP
keywords: def2/J RIJCOSX GRIDX6 NOFINALGRIDX
keywords: grid4 nofinalgrid
keywords: scfconv7
keywords: smallprint printgap noloewdin
keywords: NOSOSCF
formula: C13H12F3N5O5S
InChI: InChI=1S/C13H12F3N5O5S/c1-25-8-6-9(26-2)19-11(18-8)20-12(22)21-27(23,24)10-7(13(14,15)16)4-3-5-17-10/h3-6,20-21H,1-2H3
39 atoms
S  -1.80875 1.179162 1.16331
F  -1.863984 -0.553373 -3.125407
F  -1.096108 0.952497 -1.814084
F  -0.573072 -1.116923 -1.509961
O  -2.181993 1.173153 2.556513
O  -1.716461 2.436482 0.450663
O  -0.916853 -1.508169 1.920749
O  5.605162 -1.444057 0.020682
O  3.172672 2.436653 -0.734255
N  -0.329164 0.46142 0.963749
N  -4.021641 -0.132619 1.035934
N  1.224579 -1.237531 1.250506
N  3.413044 -1.340305 0.643841
N  2.17994 0.629752 0.248374
C  -2.952112 0.063264 0.304713
C  -2.771978 -0.485459 -0.966603
C  -3.78339 -1.322487 -1.424416
C  -1.5705 -0.291208 -1.851425
C  -4.904379 -1.545028 -0.646862
C  -0.06649 -0.803937 1.4220
C  -4.988932 -0.913225 0.579302
C  2.315791 -0.610058 0.687439
C  4.477442 -0.76397 0.103351
C  3.256414 1.198589 -0.286244
C  4.46743 0.535863 -0.390372
C  5.636394 -2.786085 0.499014
C  1.927909 3.124349 -0.642107
H  0.450521 0.998509 0.554304
H  -3.708051 -1.805245 -2.388334
H  -5.697884 -2.19185 -0.991611
H  -5.853937 -1.03863 1.217672
H  1.393133 -2.182293 1.571198
H  5.341515 0.995581 -0.827946
H  4.928758 -3.421144 -0.034078
H  6.646599 -3.140219 0.310964
H  5.431343 -2.838666 1.568362
H  1.15281 2.634542 -1.232435
H  2.107063 4.113464 -1.055039
H  1.598959 3.230911 0.392354
elementType: S F O N C H
totalener: -1850.43717777 hartree
nucrepener: 2963.52550347 hartree
electener: -4813.96268124 hartree
oneelecener: -8438.55914650 hartree
twoeener: 3624.59646526 hartree
cpcmener: -0.04162733 hartree
kineticenergy: 1844.16245976 hartree
xcener: -147.911247445006 hartree
chargesum: 0.0000000
charge: 0.866430 -0.168916 -0.168031 -0.168735 -0.474969 -0.492023 -0.445515 -0.290907 -0.288467 -0.230402 -0.290836 -0.130691 -0.424270 -0.426941 0.093979 -0.113887 -0.066646 0.560912 -0.138258 0.341376 0.059876 0.369211 0.414821 0.418411 -0.321013 -0.116586 -0.123091 0.221099 0.152255 0.168055 0.157391 0.191240 0.144933 0.113712 0.131643 0.113913 0.107505 0.139112 0.114310
qa: 0.8664 -0.1689 -0.1680 -0.1687 -0.4750 -0.4920 -0.4455 -0.2909 -0.2885 -0.2304 -0.2908 -0.1307 -0.4243 -0.4269 0.0940 -0.1139 -0.0666 0.5609 -0.1383 0.3414 0.0599 0.3692 0.4148 0.4184 -0.3210 -0.1166 -0.1231 0.2211 0.1523 0.1681 0.1574 0.1912 0.1449 0.1137 0.1316 0.1139 0.1075 0.1391 0.1143
va: 5.8128 1.1416 1.1405 1.1173 2.0345 1.9848 2.0704 2.1327 2.1425 3.0539 3.0592 3.1832 2.9705 2.9683 3.9596 3.7729 3.9575 4.3873 3.9189 4.4386 3.9919 4.2425 4.0258 3.9981 3.9300 3.8492 3.8480 1.0579 1.0058 0.9878 0.9912 1.0174 1.0164 0.9956 0.9935 0.9953 0.9973 0.9956 0.9919
dispcorr: -0.021855538 hartree
energy: -1850.459033306182
dipole: 16.35165 -15.50201 0.84963 -3.50247 1.48240 -2.02007 5.00279 -7.22750 -2.22472
magnitude: 3.12281 au
magnitude: 7.93754 debye
