program: Orca
programVersion: 4.2.1
elementType: S F F F O O O O O N N N N N C C C C C C C C C C C C C H H H H H H H H H H H H
charge: 0
multiplicity: 1
keywords: wb97x-d3
keywords: def2-TZVPP
keywords: def2/J RIJCOSX GRIDX6 NOFINALGRIDX
keywords: grid4 nofinalgrid
keywords: scfconv7
keywords: smallprint printgap noloewdin
keywords: NOSOSCF
formula: C13H12F3N5O5S
InChI: InChI=1S/C13H12F3N5O5S/c1-25-8-6-9(26-2)19-11(18-8)20-12(22)21-27(23,24)10-7(13(14,15)16)4-3-5-17-10/h3-6,20-21H,1-2H3
39 atoms
S  -1.796565 1.375259 0.956626
F  -1.148262 0.698227 -1.957871
F  -0.602415 -1.305073 -1.378201
F  -1.948024 -0.980636 -3.015953
O  -2.147693 1.593094 2.338784
O  -1.7087 2.504514 0.05429
O  -0.918307 -1.165961 2.116419
O  5.586334 -1.474316 0.188359
O  3.212432 2.306708 -1.085758
N  -0.324385 0.620889 0.850641
N  -3.998432 0.042589 1.089028
N  1.213181 -1.035252 1.378093
N  3.396556 -1.253521 0.788158
N  2.191068 0.661673 0.125357
C  -2.950472 0.134627 0.307998
C  -2.788541 -0.609529 -0.862085
C  -3.789528 -1.531483 -1.147955
C  -1.615705 -0.538763 -1.802438
C  -4.885575 -1.645591 -0.3135
C  -0.068564 -0.560533 1.499561
C  -4.958488 -0.819029 0.791718
C  2.310469 -0.507534 0.731268
C  4.469547 -0.771403 0.17713
C  3.277325 1.138784 -0.475523
C  4.479552 0.451834 -0.483972
C  5.59287 -2.744586 0.834807
C  1.979307 3.021318 -1.085585
H  0.457068 1.085581 0.36408
H  -3.72528 -2.165035 -2.021135
H  -5.669324 -2.358524 -0.523417
H  -5.804998 -0.854498 1.465127
H  1.372477 -1.924062 1.835491
H  5.361305 0.837778 -0.974174
H  6.600047 -3.132575 0.707231
H  5.373688 -2.658316 1.899131
H  4.882736 -3.43342 0.376957
H  1.194625 2.470956 -1.606119
H  2.174351 3.944033 -1.625482
H  1.653754 3.268434 -0.074354
elementType: S F O N C H
totalener: -1850.43706767 hartree
nucrepener: 2961.53214159 hartree
electener: -4811.96920927 hartree
oneelecener: -8434.58645213 hartree
twoeener: 3622.61724286 hartree
cpcmener: -0.04153962 hartree
kineticenergy: 1844.15539678 hartree
xcener: -147.909742396535 hartree
chargesum: -0.0000000
charge: 0.866990 -0.167596 -0.169040 -0.169117 -0.475249 -0.491722 -0.445791 -0.290895 -0.288611 -0.231053 -0.290378 -0.130723 -0.425181 -0.427627 0.091644 -0.109121 -0.068397 0.560149 -0.137711 0.342067 0.059868 0.369607 0.414438 0.419337 -0.321649 -0.116070 -0.123354 0.221790 0.151426 0.167734 0.157079 0.191196 0.145513 0.131824 0.113187 0.113850 0.107124 0.138980 0.115484
qa: 0.8670 -0.1676 -0.1690 -0.1691 -0.4752 -0.4917 -0.4458 -0.2909 -0.2886 -0.2311 -0.2904 -0.1307 -0.4252 -0.4276 0.0916 -0.1091 -0.0684 0.5601 -0.1377 0.3421 0.0599 0.3696 0.4144 0.4193 -0.3216 -0.1161 -0.1234 0.2218 0.1514 0.1677 0.1571 0.1912 0.1455 0.1318 0.1132 0.1138 0.1071 0.1390 0.1155
va: 5.8105 1.1408 1.1173 1.1411 2.0346 1.9851 2.0701 2.1327 2.1424 3.0528 3.0576 3.1845 2.9698 2.9668 3.9594 3.7672 3.9620 4.3909 3.9184 4.4351 3.9931 4.2422 4.0251 3.9979 3.9287 3.8491 3.8484 1.0558 1.0059 0.9879 0.9913 1.0175 1.0162 0.9934 0.9957 0.9957 0.9969 0.9956 0.9915
dispcorr: -0.021786251 hartree
energy: -1850.458853924268
dipole: 16.61033 -15.77107 0.83926 -3.04715 0.65300 -2.39415 5.66557 -7.50242 -1.83685
magnitude: 3.13215 au
magnitude: 7.96129 debye
