program: Orca
programVersion: 4.2.1
elementType: S F F F O O O O O N N N N N C C C C C C C C C C C C C H H H H H H H H H H H H
charge: 0
multiplicity: 1
keywords: wb97x-d3
keywords: def2-TZVPP
keywords: def2/J RIJCOSX GRIDX6 NOFINALGRIDX
keywords: grid4 nofinalgrid
keywords: scfconv7
keywords: smallprint printgap noloewdin
keywords: NOSOSCF
formula: C13H12F3N5O5S
InChI: InChI=1S/C13H12F3N5O5S/c1-25-8-6-9(26-2)19-11(18-8)20-12(22)21-27(23,24)10-7(13(14,15)16)4-3-5-17-10/h3-6,20-21H,1-2H3
39 atoms
S  -1.189741 -1.274045 -0.84608
F  -2.766096 -2.884133 2.005353
F  -4.799402 -2.264561 1.702004
F  -3.570551 -2.740572 0.00987
O  -2.015771 -1.453169 -2.005807
O  -0.634154 -2.380777 -0.097617
O  -0.81995 1.197842 -2.635761
O  3.742511 -0.741521 1.250452
O  5.283766 3.253262 -0.547501
N  0.121503 -0.335188 -1.207194
N  -1.677811 1.00529 0.38183
N  1.263039 1.575401 -1.864669
N  2.493058 0.383817 -0.292168
N  3.269972 2.413934 -1.20917
C  -2.089573 -0.240359 0.349527
C  -3.116722 -0.730352 1.159378
C  -3.718531 0.177738 2.019826
C  -3.55907 -2.171308 1.207028
C  -3.295361 1.494963 2.042461
C  0.08957 0.827695 -1.949811
C  -2.262343 1.863491 1.201724
C  2.383908 1.440228 -1.083332
C  3.593958 0.294072 0.446544
C  4.362203 2.310154 -0.467815
C  4.594153 1.251248 0.403617
C  2.722264 -1.730516 1.293108
C  5.064325 4.341544 -1.43078
H  0.951719 -0.472487 -0.616687
H  -4.518464 -0.137279 2.674821
H  -3.756339 2.215814 2.702422
H  -1.887186 2.879323 1.18148
H  1.250258 2.406919 -2.435821
H  5.489346 1.179005 1.00167
H  3.063688 -2.473317 2.008241
H  1.769741 -1.321807 1.632352
H  2.574957 -2.209013 0.324468
H  4.972348 4.011057 -2.465478
H  5.937549 4.980672 -1.33061
H  4.169392 4.904772 -1.165126
totalener: -1850.41160123 hartree
nucrepener: 2881.22422844 hartree
electener: -4731.63582968 hartree
oneelecener: -8273.19140209 hartree
twoeener: 3541.55557242 hartree
kineticenergy: 1844.19933307 hartree
xcener: -147.909653098901 hartree
chargesum: -0.0000000
charge: 0.834048 -0.152342 -0.173995 -0.142616 -0.392252 -0.459547 -0.330968 -0.261998 -0.263138 -0.206838 -0.286870 -0.169385 -0.425109 -0.406012 0.147157 -0.139943 -0.078864 0.530383 -0.126232 0.312369 0.034423 0.361055 0.396159 0.385052 -0.303286 -0.125116 -0.123736 0.187768 0.137976 0.138117 0.124515 0.166156 0.129645 0.127672 0.100884 0.115051 0.109529 0.123958 0.106331
qa: 0.8340 -0.1523 -0.1740 -0.1426 -0.3923 -0.4595 -0.3310 -0.2620 -0.2631 -0.2068 -0.2869 -0.1694 -0.4251 -0.4060 0.1472 -0.1399 -0.0789 0.5304 -0.1262 0.3124 0.0344 0.3611 0.3962 0.3851 -0.3033 -0.1251 -0.1237 0.1878 0.1380 0.1381 0.1245 0.1662 0.1296 0.1277 0.1009 0.1151 0.1095 0.1240 0.1063
va: 5.8402 1.1492 1.1295 1.1727 2.0963 2.0185 2.1840 2.1604 2.1500 3.0754 3.0230 3.1633 2.9795 2.9727 3.9265 3.8567 3.9704 4.4542 3.9155 4.4437 4.0462 4.2515 4.0207 4.0571 3.9337 3.8692 3.8756 1.0931 1.0123 0.9987 0.9988 1.0363 1.0217 0.9965 0.9983 0.9944 0.9969 0.9940 0.9973
dispcorr: -0.020386104 hartree
energy: -1850.431987337005
dipole: 29.38562 -28.33511 1.05051 22.27238 -20.10206 2.17032 0.08391 1.76169 1.84560
magnitude: 3.03646 au
magnitude: 7.71808 debye
