program: Orca
programVersion: 4.2.1
elementType: S F F F O O O O O N N N N N C C C C C C C C C C C C C H H H H H H H H H H H H
charge: 0
multiplicity: 1
keywords: wb97x-d3
keywords: def2-TZVPP
keywords: def2/J RIJCOSX GRIDX6 NOFINALGRIDX
keywords: grid4 nofinalgrid
keywords: scfconv7
keywords: smallprint printgap noloewdin
keywords: NOSOSCF
formula: C13H12F3N5O5S
InChI: InChI=1S/C13H12F3N5O5S/c1-25-8-6-9(26-2)19-11(18-8)20-12(22)21-27(23,24)10-7(13(14,15)16)4-3-5-17-10/h3-6,20-21H,1-2H3
39 atoms
S  -1.463677 1.099082 -0.575028
F  -3.457983 1.443319 2.438478
F  -4.15941 1.668439 0.411702
F  -5.264067 0.470141 1.80589
O  -1.228739 2.058011 0.482758
O  -2.276596 1.386979 -1.722113
O  -0.421731 -0.618271 -2.904591
O  5.995942 -1.515371 -0.941313
O  3.411739 1.273206 1.725446
N  0.053113 0.636053 -1.039809
N  -1.395407 -1.479661 -0.041532
N  1.675638 -0.653102 -2.08262
N  3.832404 -1.083124 -1.514948
N  2.524023 0.333094 -0.15508
C  -2.103361 -0.406075 0.219522
C  -3.239974 -0.414312 1.031344
C  -3.617781 -1.640569 1.5614
C  -4.03011 0.811645 1.4150
C  -2.88071 -2.775725 1.273404
C  0.345268 -0.237178 -2.067267
C  -1.768549 -2.64418 0.463657
C  2.712746 -0.450803 -1.205766
C  4.85053 -0.908403 -0.686771
C  3.555088 0.499054 0.66673
C  4.77918 -0.112292 0.451496
C  6.08844 -2.327781 -2.100913
C  2.163886 1.918716 1.941395
H  0.807697 0.812527 -0.364777
H  -4.487179 -1.71561 2.199074
H  -3.163488 -3.73865 1.674069
H  -1.151096 -3.497402 0.211246
H  1.89481 -1.264453 -2.854646
H  5.617857 0.02264 1.116799
H  7.102166 -2.71916 -2.104055
H  5.379042 -3.155177 -2.073461
H  5.917405 -1.753725 -3.011808
H  1.353432 1.203976 2.089565
H  1.899656 2.585196 1.119708
H  2.289949 2.504179 2.847665
totalener: -1850.41172409 hartree
nucrepener: 2878.18325491 hartree
electener: -4728.59497901 hartree
oneelecener: -8267.12894218 hartree
twoeener: 3538.53396317 hartree
kineticenergy: 1844.19827353 hartree
xcener: -147.909587214377 hartree
chargesum: -0.0000000
charge: 0.834265 -0.152262 -0.142917 -0.174071 -0.459891 -0.392449 -0.331593 -0.263168 -0.261485 -0.206577 -0.285925 -0.169451 -0.405819 -0.425976 0.147192 -0.142528 -0.076870 0.530469 -0.127508 0.313391 0.034478 0.361364 0.384928 0.395713 -0.302298 -0.125101 -0.126442 0.187689 0.138750 0.138310 0.124591 0.166459 0.129415 0.124065 0.107247 0.109354 0.101801 0.114793 0.128056
qa: 0.8343 -0.1523 -0.1429 -0.1741 -0.4599 -0.3924 -0.3316 -0.2632 -0.2615 -0.2066 -0.2859 -0.1695 -0.4058 -0.4260 0.1472 -0.1425 -0.0769 0.5305 -0.1275 0.3134 0.0345 0.3614 0.3849 0.3957 -0.3023 -0.1251 -0.1264 0.1877 0.1388 0.1383 0.1246 0.1665 0.1294 0.1241 0.1072 0.1094 0.1018 0.1148 0.1281
va: 5.8381 1.1496 1.1724 1.1293 2.0183 2.0961 2.1838 2.1503 2.1606 3.0756 3.0256 3.1620 2.9737 2.9796 3.9275 3.8575 3.9687 4.4543 3.9148 4.4426 4.0469 4.2509 4.0572 4.0211 3.9321 3.8758 3.8691 1.0930 1.0121 0.9987 0.9988 1.0362 1.0219 0.9939 0.9970 0.9969 0.9977 0.9949 0.9962
dispcorr: -0.020311342 hartree
energy: -1850.432035434605
dipole: 34.19508 -32.66658 1.52850 -13.33620 11.09441 -2.24180 -3.26200 4.54703 1.28503
magnitude: 3.00221 au
magnitude: 7.63101 debye
