program: Orca
programVersion: 4.2.1
elementType: S F F F O O O O O N N N N N C C C C C C C C C C C C C H H H H H H H H H H H H
charge: 0
multiplicity: 1
keywords: wb97x-d3
keywords: def2-TZVPP
keywords: def2/J RIJCOSX GRIDX6 NOFINALGRIDX
keywords: grid4 nofinalgrid
keywords: scfconv7
keywords: smallprint printgap noloewdin
keywords: NOSOSCF
formula: C13H12F3N5O5S
InChI: InChI=1S/C13H12F3N5O5S/c1-25-8-6-9(26-2)19-11(18-8)20-12(22)21-27(23,24)10-7(13(14,15)16)4-3-5-17-10/h3-6,20-21H,1-2H3
39 atoms
S  -1.350098 0.995041 -0.415857
F  -3.632963 1.399322 2.374039
F  -4.028498 1.906211 0.315884
F  -5.46782 0.785975 1.443575
O  -1.113879 1.827683 0.744111
O  -1.96633 1.49045 -1.614553
O  -0.283048 -0.709677 -2.738766
O  6.255512 -1.1924 -1.025691
O  3.526296 1.11521 1.938244
N  0.13637 0.35418 -0.750527
N  -1.723189 -1.59586 -0.138517
N  1.814655 -0.742844 -1.914426
N  4.030584 -0.97117 -1.470934
N  2.647005 0.194903 0.043693
C  -2.2920 -0.449967 0.149292
C  -3.51573 -0.34277 0.814799
C  -4.141182 -1.532815 1.160533
C  -4.157006 0.956631 1.232324
C  -3.550558 -2.742832 0.842003
C  0.46858 -0.382567 -1.864783
C  -2.331253 -2.723452 0.191503
C  2.866695 -0.488405 -1.069416
C  5.065197 -0.736777 -0.678719
C  3.696457 0.427608 0.825191
C  4.967222 -0.025778 0.51262
C  6.378418 -1.905812 -2.245853
C  2.229223 1.604037 2.252995
H  0.879699 0.522583 -0.06201
H  -5.090483 -1.520998 1.676902
H  -4.027019 -3.678145 1.098527
H  -1.81993 -3.640396 -0.074504
H  2.058304 -1.270668 -2.738944
H  5.820372 0.163355 1.145481
H  6.091487 -1.295255 -3.102349
H  7.429316 -2.170832 -2.325235
H  5.773402 -2.812869 -2.247617
H  1.511929 0.794551 2.395117
H  1.848746 2.282048 1.488532
H  2.339642 2.147472 3.187095
totalener: -1850.41191504 hartree
nucrepener: 2857.62460692 hartree
electener: -4708.03652196 hartree
oneelecener: -8226.18520449 hartree
twoeener: 3518.14868252 hartree
kineticenergy: 1844.20155061 hartree
xcener: -147.910289828215 hartree
chargesum: 0.0000000
charge: 0.832148 -0.152492 -0.143538 -0.174296 -0.462992 -0.395270 -0.338577 -0.263156 -0.261409 -0.209589 -0.277133 -0.171719 -0.406927 -0.427882 0.150981 -0.151754 -0.074941 0.531183 -0.129501 0.326496 0.035803 0.363158 0.384548 0.395347 -0.301296 -0.125763 -0.128007 0.191386 0.138514 0.138302 0.125589 0.166540 0.129416 0.109212 0.124371 0.107736 0.103970 0.113868 0.127673
qa: 0.8321 -0.1525 -0.1435 -0.1743 -0.4630 -0.3953 -0.3386 -0.2632 -0.2614 -0.2096 -0.2771 -0.1717 -0.4069 -0.4279 0.1510 -0.1518 -0.0749 0.5312 -0.1295 0.3265 0.0358 0.3632 0.3845 0.3953 -0.3013 -0.1258 -0.1280 0.1914 0.1385 0.1383 0.1256 0.1665 0.1294 0.1092 0.1244 0.1077 0.1040 0.1139 0.1277
va: 5.8222 1.1491 1.1716 1.1290 2.0155 2.0935 2.1793 2.1502 2.1605 3.0827 3.0383 3.1590 2.9727 2.9801 3.9387 3.8665 3.9650 4.4512 3.9119 4.4378 4.0453 4.2486 4.0583 4.0232 3.9336 3.8756 3.8679 1.0878 1.0125 0.9987 0.9980 1.0365 1.0218 0.9970 0.9936 0.9968 0.9949 0.9980 0.9967
dispcorr: -0.019898011 hartree
energy: -1850.431813054362
dipole: 33.78431 -32.62759 1.15672 -13.64326 11.43938 -2.20388 -3.23065 4.24954 1.01890
magnitude: 2.68947 au
magnitude: 6.83608 debye
