program: Gaussian 09
title: 000068998
version: EM64L-G09RevD.01
frameworkgroup: C1[X(C23H25ClN2O)]
method: RPBEPBE
basis: SDD
operation: Freq
keyword: #p
keyword: freq=noraman
keyword: PBEPBE/SDD
title: #p freq=noraman PBEPBE/SDD
converged: YES YES NO NO
title: Mulliken charges:
elementType: Cl O N N C C C C C C C C C C C C C C C C C C C C C C C H H H H H H H H H H H H H H H H H H H H H H H H H
charge: -0.075819 -0.450412 -0.154106 -0.155938 -0.097716 0.367163 0.335347 0.508273 -0.402728 -0.386180 -0.408469 -0.376123 -0.314690 -0.360660 0.400739 0.400403 -0.378535 -0.384917 -0.362642 -0.369215 -0.254377 -0.257784 -0.235311 -0.647603 -0.646841 -0.647477 -0.646625 0.242112 0.251713 0.269043 0.270401 0.270877 0.338881 0.232935 0.232748 0.232594 0.232742 0.254918 0.230684 0.232942 0.230519 0.214399 0.232507 0.213557 0.232034 0.232652 0.214118 0.231990 0.230372 0.233175 0.213216 0.231110
chargesum: 0.00000
title: Mulliken charges with hydrogens summed into heavy atoms:
elementType: Cl O N N C C C C C C C C C C C C C C C C C C C C C C C
charge: -0.075819 -0.111530 -0.154106 -0.155938 -0.097716 0.367163 0.335347 0.508273 -0.160616 -0.134467 -0.139426 -0.105721 -0.314690 -0.089782 0.400739 0.400403 -0.145600 -0.152169 -0.130048 -0.136473 0.000541 -0.027100 -0.002369 0.029822 0.031403 0.029003 0.030876
polarizability: 3.58091190e+02 5.21985996e+00 2.86498582e+02 4.58147825e+00 8.59713454e+00 2.21907977e+02
1716.lowfreq: -10.8227 -0.0018 -0.0017 -0.0004 4.8962 8.7908 24.5357 29.7955 31.1010
frequency: 24.1461 29.6569 31.0839 39.4123 43.8268 60.1152 79.6600 81.7565 84.7365 88.0594 118.5632 125.2463 131.9262 163.4170 165.8456 184.9547 204.7567 205.6219 219.2949 229.5343 241.8228 257.5142 282.5630 302.0781 322.8708 330.0536 356.7762 399.9940 408.0435 414.1709 416.1974 420.1007 434.6877 451.9427 465.1983 467.9446 476.6010 495.6301 529.3690 536.3765 569.2079 572.8286 588.5347 632.1534 633.9904 639.0254 678.8157 718.9792 734.2422 740.5662 744.3713 753.1627 762.2656 806.0637 809.2846 817.7082 817.8389 865.4696 887.4038 904.4385 938.7500 942.7536 944.6530 948.9296 953.8491 964.0142 965.3774 967.0599 988.5739 1000.3317 1001.2109 1010.7375 1045.4868 1054.7694 1057.1958 1108.9803 1109.4479 1111.0377 1111.1092 1120.0741 1131.3202 1135.8816 1153.0679 1162.0277 1166.0797 1170.9444 1174.2030 1193.1046 1212.9541 1219.6234 1264.0833 1265.4932 1270.0836 1310.6177 1315.9606 1328.0423 1355.8691 1357.5272 1362.3516 1373.2276 1376.8724 1420.0415 1421.5537 1422.5049 1435.3718 1436.2108 1452.8789 1455.6440 1458.2477 1462.6125 1462.6706 1472.7915 1472.9036 1494.2921 1494.5854 1506.1272 1507.0261 1522.4182 1526.1138 1562.7820 1564.5932 1569.0861 1600.0852 1630.4560 1632.5051 2931.0285 2931.3795 2939.9251 2940.5169 2993.8122 2994.9529 2996.9472 2997.5935 3087.5973 3090.4355 3098.9043 3100.3689 3125.9321 3134.6361 3135.6941 3139.5792 3148.0070 3151.2603 3160.1030 3163.3830 3164.4059 3165.1993 3171.1533 3174.1577 3488.7210
redmass: 4.1909 3.6021 3.3789 5.2248 5.2097 4.3970 2.4162 2.5452 2.9747 2.6864 1.8693 1.9467 4.5768 7.3013 3.5976 5.1057 1.1960 1.1266 2.0991 2.3935 4.5073 3.5635 4.3123 5.5028 4.4079 4.9699 4.5208 5.4084 3.3693 4.0439 3.2069 3.0951 3.5265 3.3748 3.2866 1.5613 2.5920 3.8498 2.9722 2.5849 3.1946 3.8474 4.1911 6.9621 7.0178 6.3059 5.6804 4.3745 3.9164 4.0773 4.1044 5.1997 1.3005 1.3577 1.3099 1.8166 1.6440 1.4248 3.6549 4.1213 2.3854 2.5068 2.8680 1.6240 1.5209 2.1746 1.3688 1.3913 1.3649 2.9534 2.9218 7.0593 2.3191 1.4816 1.4876 1.3065 1.3122 1.2489 1.2438 1.8125 1.4338 1.4467 2.3274 1.8884 1.8317 1.5906 1.0991 1.4699 1.2190 1.9706 2.9186 2.9510 1.4233 1.5211 1.4175 1.5215 3.2181 3.2987 7.4381 5.9243 5.7105 2.2358 1.8796 2.0609 1.6178 1.4732 2.2941 1.2205 1.2124 1.0416 1.0414 1.0465 1.0464 1.0810 1.0805 1.1343 1.1246 2.4334 2.4828 6.8512 6.9083 5.9910 6.9614 6.1022 6.2364 1.0369 1.0366 1.0395 1.0395 1.0992 1.0989 1.1026 1.1029 1.0962 1.0956 1.0938 1.0936 1.0880 1.0858 1.0877 1.0873 1.0869 1.0907 1.0933 1.0935 1.0939 1.0948 1.0957 1.0999 1.0647
irintensity: 0.9381 0.5009 0.1105 1.3406 0.5955 1.0529 0.1428 1.4229 3.5560 3.6532 0.7413 0.1926 0.2550 1.4370 1.1355 1.0450 0.2893 0.0757 1.4816 2.9558 0.1488 0.9727 2.4077 1.7755 1.6094 3.1791 3.1990 17.9661 6.7939 4.2938 2.2152 1.2055 8.6081 10.0081 36.0040 128.9576 24.4571 7.3759 1.7198 1.9676 23.8672 7.9842 13.9953 0.7785 0.5872 5.1411 24.7511 3.8245 1.6142 0.3005 6.8761 4.8213 75.1794 17.6007 11.5398 85.4933 61.9035 0.2921 15.7844 14.8858 23.0973 6.6809 22.2209 7.5834 0.6787 9.4710 0.3657 0.9982 0.3988 2.6738 3.5009 59.9435 7.1945 24.7929 25.4451 0.9240 0.9591 0.2187 0.1413 8.5407 0.9725 1.5482 19.0420 46.8129 11.8537 24.3814 2.1501 82.0466 43.2048 4.1188 32.7615 34.8086 26.2008 27.2414 7.6661 67.4199 146.2414 140.6275 21.4303 10.7928 10.7023 30.4026 6.4529 11.7149 1.6353 1.7205 22.8407 11.7273 11.1964 0.1056 0.1187 19.8447 19.8159 3.1073 2.2615 22.1854 24.7110 375.9455 187.1127 11.3220 22.9109 26.9029 3.2217 267.1670 114.7279 112.9425 122.1630 145.3347 62.5499 9.2176 1.7158 86.1878 92.6958 4.5257 4.1989 56.0036 55.3165 12.6909 2.0479 7.7539 6.0503 12.5228 10.8223 24.1485 19.1991 7.1782 13.6507 10.6464 21.0654 24.5407
temp: 298.150 k
press: 1.00000 atm
elementType: 17 8 7 7 6 6 6 6 6 6 6 6 6 6 6 6 6 6 6 6 6 6 6 6 6 6 6 1 1 1 1 1 1 1 1 1 1 1 1 1 1 1 1 1 1 1 1 1 1 1 1 1
symmnumber: 1
zpe: 1106849.4 jmol-1
zpe.correction: 0.421577 hartree
zpe.thermalcorrener: 0.448291 hartree
zpe.thermalcorrenthalpy: 0.449235 hartree
zpe.thermalcorrgfe: 0.363112 hartree
zpe.sumelectzpe: -1534.255063 hartree
zpe.sumelectthermal: -1534.228349 hartree
zpe.sumelectthermalent: -1534.227405 hartree
zpe.sumelectthermalfe: -1534.313528 hartree
dipole: 0.4289 -2.5619 3.0936
dipole: 4.0395
quadrupole: -126.5213 -147.2289 -163.1184
quadrupole: 4.2672 -0.1152 3.5079
quadrupole: 19.1015 -1.6060 -17.4955 4.2672 -0.1152 3.5079
hfenergy: -1534.6766395 hartree
pointgroup: C01 [X(C23H25Cl1N2O1)]
dipole: -0.059972 -0.9691681 -1.2581397 debye
polarizability: 358.2452602|0.9489902|286.6871356|7.5627763|-5.5499993|221.5653534 unknown
InChI: InChI=1S/C23H25ClN2O/c1-25(2)19-13-9-17(10-14-19)23(27,21-7-5-6-8-22(21)24)18-11-15-20(16-12-18)26(3)4/h5-16,27H,1-4H3
charge 0 multiplicity 1
52 atoms
Cl 2.165506 3.06343 1.514854
O  -0.139439 1.077489 2.244234
N  4.692824 -2.350876 -0.370838
N  -4.917237 -2.225471 -0.32909
C  -0.067498 0.806062 0.77947
C  1.214716 0.014175 0.455583
C  -1.329453 -0.030406 0.496417
C  -0.098795 2.167436 0.020582
C  1.945521 0.180609 -0.743791
C  -1.363268 -1.026158 -0.50775
C  1.661572 -0.978133 1.364469
C  -2.523353 0.217814 1.218491
C  0.816269 3.224001 0.261158
C  -1.076979 2.424181 -0.977459
C  3.55146 -1.582907 -0.104713
C  -3.744382 -1.507036 -0.060004
C  3.088784 -0.592503 -1.02636
C  -2.537612 -1.7523 -0.788075
C  2.800854 -1.758137 1.102535
C  -3.703866 -0.500926 0.958228
C  0.781743 4.45563 -0.418155
C  -1.138715 3.646968 -1.680042
C  -0.208372 4.670968 -1.402588
C  5.446809 -2.135186 -1.609577
C  5.152979 -3.346229 0.60336
C  -4.921273 -3.25577 -1.372277
C  -6.132718 -1.964832 0.449207
H  1.629808 0.93384 -1.475029
H  -0.453768 -1.251983 -1.075123
H  1.098244 -1.131553 2.291242
H  -2.509201 0.972477 2.010273
H  -1.803491 1.636958 -1.197861
H  0.701937 1.54178 2.502318
H  3.621789 -0.417442 -1.965263
H  -2.508725 -2.51763 -1.568973
H  3.10811 -2.506323 1.838978
H  -4.595757 -0.280432 1.551926
H  1.516658 5.230071 -0.179945
H  -1.913141 3.795886 -2.440085
H  -0.244663 5.6262 -1.936969
H  4.82741 -2.329184 -2.509755
H  6.308635 -2.820834 -1.639622
H  5.834768 -1.097802 -1.683321
H  6.061678 -3.839087 0.222252
H  4.390744 -4.132208 0.784149
H  5.400955 -2.884827 1.581899
H  -5.926024 -3.702043 -1.44421
H  -4.201071 -4.07179 -1.153383
H  -4.663642 -2.83645 -2.366968
H  -5.981468 -2.158119 1.531589
H  -6.941888 -2.624825 0.097663
H  -6.477773 -0.915875 0.338646
