program: Orca
programVersion: 4.2.1
elementType: S F F F O O O O O N N N N N C C C C C C C C C C C C C H H H H H H H H H H H H
charge: 0
multiplicity: 1
keywords: wb97x-d3
keywords: def2-TZVPP
keywords: def2/J RIJCOSX GRIDX6 NOFINALGRIDX
keywords: grid4 nofinalgrid
keywords: scfconv7
keywords: smallprint printgap noloewdin
keywords: NOSOSCF
formula: C13H12F3N5O5S
InChI: InChI=1S/C13H12F3N5O5S/c1-25-8-6-9(26-2)19-11(18-8)20-12(22)21-27(23,24)10-7(13(14,15)16)4-3-5-17-10/h3-6,20-21H,1-2H3
39 atoms
S  -1.824537 1.191059 1.201322
F  -1.828005 -0.580705 -3.098881
F  -1.078595 0.95061 -1.806053
F  -0.543689 -1.111562 -1.468045
O  -2.205966 1.174694 2.583779
O  -1.714599 2.430915 0.465553
O  -0.907614 -1.555716 1.899714
O  5.597894 -1.4513 -0.005665
O  3.16755 2.432729 -0.757755
N  -0.344391 0.45555 0.999063
N  -4.039637 -0.123959 1.026248
N  1.234751 -1.227554 1.265891
N  3.412561 -1.338961 0.634102
N  2.181423 0.637016 0.249139
C  -2.953768 0.06897 0.319907
C  -2.754165 -0.485402 -0.949496
C  -3.7598 -1.319941 -1.422251
C  -1.541861 -0.294423 -1.824944
C  -4.895856 -1.540126 -0.665589
C  -0.079654 -0.817883 1.431688
C  -4.998065 -0.90234 0.556244
C  2.315462 -0.604134 0.688564
C  4.471651 -0.766906 0.081893
C  3.252715 1.197441 -0.302896
C  4.461034 0.530232 -0.418826
C  5.623838 -2.778834 0.494387
C  1.929807 3.122633 -0.649001
H  0.420693 0.997449 0.582839
H  -3.665503 -1.798466 -2.386357
H  -5.684187 -2.186888 -1.023125
H  -5.873569 -1.019193 1.183126
H  1.406531 -2.174832 1.567642
H  5.331004 0.984545 -0.867062
H  4.908136 -3.419643 -0.021283
H  6.632046 -3.140741 0.311671
H  5.413243 -2.812865 1.563602
H  1.132658 2.620819 -1.198204
H  2.100768 4.101922 -1.086946
H  1.621704 3.246775 0.390092
totalener: -1850.41055964 hartree
nucrepener: 2963.40761073 hartree
electener: -4813.81817037 hartree
oneelecener: -8437.50562105 hartree
twoeener: 3623.68745067 hartree
kineticenergy: 1844.20299903 hartree
xcener: -147.909088735985 hartree
chargesum: 0.0000000
charge: 0.843515 -0.168672 -0.158276 -0.163586 -0.396794 -0.454546 -0.357192 -0.262997 -0.261452 -0.244349 -0.231820 -0.158295 -0.406391 -0.425766 0.083459 -0.129198 -0.079155 0.553266 -0.125123 0.313916 0.041274 0.364446 0.385020 0.396448 -0.300816 -0.126150 -0.125764 0.209460 0.134716 0.136593 0.131658 0.167483 0.129120 0.108400 0.124232 0.109143 0.104400 0.129042 0.110749
qa: 0.8435 -0.1687 -0.1583 -0.1636 -0.3968 -0.4545 -0.3572 -0.2630 -0.2615 -0.2443 -0.2318 -0.1583 -0.4064 -0.4258 0.0835 -0.1292 -0.0792 0.5533 -0.1251 0.3139 0.0413 0.3644 0.3850 0.3964 -0.3008 -0.1262 -0.1258 0.2095 0.1347 0.1366 0.1317 0.1675 0.1291 0.1084 0.1242 0.1091 0.1044 0.1290 0.1107
va: 5.8386 1.1383 1.1556 1.1213 2.1250 2.0247 2.1569 2.1513 2.1606 3.0611 3.0945 3.1663 2.9748 2.9652 3.9812 3.7918 3.9801 4.3979 3.9021 4.4350 4.0297 4.2384 4.0589 4.0286 3.9372 3.8758 3.8696 1.0602 1.0142 0.9991 0.9942 1.0359 1.0218 0.9968 0.9939 0.9966 0.9993 0.9957 0.9943
dispcorr: -0.021910625 hartree
energy: -1850.432470261748
dipole: 16.21699 -15.58169 0.63530 -3.42713 2.03799 -1.38914 4.82320 -6.28121 -1.45801
magnitude: 2.11166 au
magnitude: 5.36741 debye
