program: Orca
programVersion: 4.2.1
elementType: S F F F O O O O O N N N N N C C C C C C C C C C C C C H H H H H H H H H H H H
charge: 0
multiplicity: 1
keywords: wb97x-d3
keywords: def2-TZVPP
keywords: def2/J RIJCOSX GRIDX6 NOFINALGRIDX
keywords: grid4 nofinalgrid
keywords: scfconv7
keywords: smallprint printgap noloewdin
keywords: NOSOSCF
formula: C13H12F3N5O5S
InChI: InChI=1S/C13H12F3N5O5S/c1-25-8-6-9(26-2)19-11(18-8)20-12(22)21-27(23,24)10-7(13(14,15)16)4-3-5-17-10/h3-6,20-21H,1-2H3
39 atoms
S  -1.792733 1.351723 1.040483
F  -1.101904 0.683912 -1.913007
F  -0.596267 -1.323175 -1.304901
F  -1.899878 -0.994185 -2.973259
O  -2.146792 1.529294 2.418766
O  -1.684122 2.478115 0.140699
O  -0.887842 -1.287168 2.085743
O  5.616694 -1.448787 0.170924
O  3.172143 2.27691 -1.133214
N  -0.323379 0.577309 0.912243
N  -4.026089 0.058118 1.08785
N  1.251075 -1.060548 1.396283
N  3.430136 -1.254439 0.78726
N  2.192503 0.641076 0.12151
C  -2.952026 0.134982 0.34233
C  -2.785493 -0.590016 -0.84278
C  -3.813082 -1.462684 -1.180564
C  -1.586094 -0.542918 -1.754624
C  -4.937033 -1.55841 -0.381128
C  -0.060616 -0.625276 1.514065
C  -5.004567 -0.760683 0.745478
C  2.330356 -0.523391 0.735365
C  4.487481 -0.763841 0.158548
C  3.261945 1.120188 -0.505591
C  4.472557 0.447384 -0.524172
C  5.649159 -2.688836 0.859598
C  1.928878 2.965992 -1.130473
H  0.441842 1.050036 0.418116
H  -3.744683 -2.067987 -2.072911
H  -5.74233 -2.233029 -0.634165
H  -5.868731 -0.777023 1.398265
H  1.424525 -1.956107 1.827179
H  5.341219 0.83523 -1.033258
H  6.658905 -3.068991 0.730285
H  5.439699 -2.567113 1.922639
H  4.936126 -3.401494 0.444382
H  1.137889 2.381653 -1.601047
H  2.093947 3.8710 -1.708087
H  1.615909 3.239752 -0.121951
totalener: -1850.41071324 hartree
nucrepener: 2961.81885676 hartree
electener: -4812.22957000 hartree
oneelecener: -8434.33617657 hartree
twoeener: 3622.10660657 hartree
kineticenergy: 1844.20388739 hartree
xcener: -147.909429035394 hartree
chargesum: -0.0000000
charge: 0.844474 -0.158582 -0.163152 -0.168916 -0.397026 -0.454562 -0.357818 -0.262949 -0.261616 -0.245536 -0.232586 -0.158051 -0.406856 -0.425277 0.084402 -0.128899 -0.080118 0.553947 -0.125083 0.313714 0.041684 0.364344 0.385257 0.396577 -0.301095 -0.125527 -0.125620 0.209683 0.134799 0.136412 0.131473 0.167395 0.129694 0.124410 0.108852 0.107899 0.104402 0.128753 0.111099
qa: 0.8445 -0.1586 -0.1632 -0.1689 -0.3970 -0.4546 -0.3578 -0.2629 -0.2616 -0.2455 -0.2326 -0.1581 -0.4069 -0.4253 0.0844 -0.1289 -0.0801 0.5539 -0.1251 0.3137 0.0417 0.3643 0.3853 0.3966 -0.3011 -0.1255 -0.1256 0.2097 0.1348 0.1364 0.1315 0.1674 0.1297 0.1244 0.1089 0.1079 0.1044 0.1288 0.1111
va: 5.8372 1.1550 1.1218 1.1379 2.1252 2.0243 2.1563 2.1512 2.1608 3.0612 3.0935 3.1670 2.9744 2.9667 3.9812 3.7942 3.9804 4.3978 3.9027 4.4343 4.0299 4.2394 4.0579 4.0288 3.9358 3.8758 3.8695 1.0603 1.0141 0.9992 0.9943 1.0359 1.0217 0.9938 0.9968 0.9970 0.9995 0.9957 0.9943
dispcorr: -0.021887560 hartree
energy: -1850.432600805104
dipole: 16.33660 -15.73971 0.59689 -2.70589 1.14031 -1.56558 5.15077 -6.40107 -1.25030
magnitude: 2.09059 au
magnitude: 5.31385 debye
