program: Orca
programVersion: 4.2.1
elementType: S F F F O O O O O N N N N N C C C C C C C C C C C C C H H H H H H H H H H H H
charge: 0
multiplicity: 1
keywords: wb97x-d3
keywords: def2-TZVPP
keywords: def2/J RIJCOSX GRIDX6 NOFINALGRIDX
keywords: grid4 nofinalgrid
keywords: scfconv7
keywords: smallprint printgap noloewdin
keywords: NOSOSCF
formula: C13H12F3N5O5S
InChI: InChI=1S/C13H12F3N5O5S/c1-25-8-6-9(26-2)19-11(18-8)20-12(22)21-27(23,24)10-7(13(14,15)16)4-3-5-17-10/h3-6,20-21H,1-2H3
39 atoms
S  -1.334642 1.125742 0.136795
F  -4.484722 0.690784 1.787976
F  -4.257185 1.629335 -0.147566
F  -5.78221 0.155512 0.16906
O  -1.856409 1.737028 1.32819
O  -1.272189 1.821741 -1.128899
O  -0.155215 -0.61785 2.26565
O  3.46434 1.31872 -2.497074
O  6.334592 -0.991818 0.329969
N  0.224463 0.625027 0.392386
N  -1.408931 -1.392035 -0.578595
N  1.936926 -0.560092 1.420648
N  2.679265 0.399995 -0.561816
N  4.132078 -0.776248 0.878115
C  -2.202812 -0.442408 -0.141977
C  -3.574767 -0.608491 0.047517
C  -4.085737 -1.87499 -0.204915
C  -4.520509 0.485676 0.478243
C  -3.246734 -2.886238 -0.636334
C  0.593095 -0.207158 1.419138
C  -1.90911 -2.590978 -0.823868
C  2.951488 -0.29115 0.53348
C  3.68956 0.632672 -1.392806
C  5.128999 -0.536359 0.040012
C  4.974177 0.178733 -1.142655
C  2.151403 1.801768 -2.749191
C  6.513297 -1.712624 1.538974
H  0.901366 0.775933 -0.361983
H  -5.13894 -2.075849 -0.071151
H  -3.627893 -3.878014 -0.832918
H  -1.212742 -3.339677 -1.181177
H  2.205956 -1.129891 2.208502
H  5.795967 0.368994 -1.815443
H  2.210119 2.328552 -3.697388
H  1.426658 0.991152 -2.835148
H  1.815761 2.494939 -1.976872
H  6.266097 -1.107297 2.411453
H  7.566679 -1.977949 1.568502
H  5.908857 -2.619744 1.56286
totalener: -1850.41498689 hartree
nucrepener: 2863.36639000 hartree
electener: -4713.78137690 hartree
oneelecener: -8237.71280138 hartree
twoeener: 3523.93142449 hartree
kineticenergy: 1844.20369307 hartree
xcener: -147.910798154292 hartree
chargesum: -0.0000000
charge: 0.838889 -0.141415 -0.151410 -0.176517 -0.407711 -0.455867 -0.358099 -0.261487 -0.263033 -0.200333 -0.304779 -0.167010 -0.427690 -0.407267 0.154996 -0.134455 -0.080147 0.533001 -0.127097 0.327622 0.041290 0.362679 0.396775 0.383730 -0.300304 -0.130857 -0.125870 0.193059 0.138923 0.137878 0.125878 0.167035 0.129637 0.128222 0.107995 0.112463 0.109361 0.124472 0.107445
qa: 0.8389 -0.1414 -0.1514 -0.1765 -0.4077 -0.4559 -0.3581 -0.2615 -0.2630 -0.2003 -0.3048 -0.1670 -0.4277 -0.4073 0.1550 -0.1345 -0.0801 0.5330 -0.1271 0.3276 0.0413 0.3627 0.3968 0.3837 -0.3003 -0.1309 -0.1259 0.1931 0.1389 0.1379 0.1259 0.1670 0.1296 0.1282 0.1080 0.1125 0.1094 0.1245 0.1074
va: 5.8160 1.1656 1.1596 1.1241 2.0863 2.0262 2.1594 2.1600 2.1504 3.1021 3.0266 3.1670 2.9752 2.9731 3.9156 3.8572 3.9718 4.4587 3.9102 4.4268 4.0419 4.2481 4.0235 4.0585 3.9346 3.8672 3.8756 1.0796 1.0128 0.9988 0.9977 1.0361 1.0216 0.9961 0.9962 0.9966 0.9969 0.9937 0.9969
dispcorr: -0.020078994 hartree
energy: -1850.435065887743
dipole: 36.39924 -35.04544 1.35380 -11.00690 8.76782 -2.23908 -6.87632 5.91658 -0.95974
magnitude: 2.78700 au
magnitude: 7.08398 debye
