program: Gaussian 09
title: 000068996
version: EM64L-G09RevD.01
frameworkgroup: C1[X(C20H14O6)]
method: RPBEPBE
basis: SDD
operation: Freq
keyword: #pfreq=noraman
keyword: PBEPBE/SDD
title: #p freq=noraman PBEPBE/SDD
converged: YES YES NO NO
title: Mulliken charges:
elementType: O O O O O O C C C C C C C C C C C C C C C C C C C C H H H H H H H H H H H H H H
charge: -0.261389 -0.203602 -0.489518 -0.434895 -0.424323 -0.483771 -0.084163 0.261885 0.522795 0.462385 0.074797 0.067403 -0.357880 -0.481271 -0.505795 -0.396529 -0.402959 -0.372700 -0.232982 -0.220313 0.165707 0.165793 -0.345021 -0.323861 0.127006 0.116650 0.256918 0.252487 0.278824 0.250935 0.272409 0.269180 0.235044 0.236629 0.253436 0.225079 0.377373 0.385689 0.386363 0.376186
chargesum: 0.00000
title: Mulliken charges with hydrogens summed into heavy atoms:
elementType: O O O O O O C C C C C C C C C C C C C C C C C C C C
charge: -0.261389 -0.203602 -0.112145 -0.049206 -0.037960 -0.107586 -0.084163 0.261885 0.522795 0.462385 0.074797 0.067403 -0.100962 -0.228784 -0.226972 -0.145594 -0.130549 -0.103520 0.002061 0.016316 0.165707 0.165793 -0.091584 -0.098783 0.127006 0.116650
polarizability: 2.39007758e+02 7.89286003e+00 2.67480632e+02 1.33320239e+01 -2.93044240e+00 2.06263073e+02
1716.lowfreq: -5.1685 0.0006 0.0008 0.0008 0.2126 5.6590 23.5886 35.3185 38.8560
frequency: 23.4748 35.2046 38.8467 43.3592 61.4559 65.0015 136.6902 146.3975 148.2956 195.5176 210.4255 219.8803 250.5059 251.6555 261.5471 278.2385 281.1303 287.3535 289.6547 293.8590 306.0578 360.1638 378.5085 417.5754 434.8444 438.8676 444.7949 467.7983 486.5481 500.7019 502.6530 510.9834 551.0785 558.6872 567.6207 577.2444 606.1017 615.5502 628.4842 663.3513 666.4406 698.4080 719.2279 724.0010 750.0533 754.3112 763.4972 774.1765 787.9409 799.9080 820.1881 835.3976 852.5811 862.9906 871.8790 893.6936 902.2998 934.6306 946.6713 966.4076 973.2760 976.7279 1001.8642 1002.2928 1031.1819 1070.6667 1077.3718 1094.3207 1131.6591 1140.1926 1143.7143 1171.3420 1173.0736 1180.6156 1184.7365 1194.2016 1226.4650 1238.4064 1244.0974 1270.9570 1279.9793 1283.6153 1310.4520 1335.0832 1394.8519 1402.3925 1408.7324 1436.9877 1449.9010 1458.1876 1460.3211 1502.5682 1520.4547 1603.2706 1608.1254 1613.5977 1616.7894 1624.9536 1629.1867 1693.0606 3125.5585 3128.8828 3135.1756 3147.6975 3154.9664 3158.1540 3159.4321 3171.2030 3176.7195 3183.3006 3520.4173 3525.6650 3622.8722 3623.2951
redmass: 5.2062 5.4254 7.4404 6.7119 7.1518 6.2947 5.5160 6.1775 6.6236 6.8377 5.6763 5.6883 5.3625 6.0611 5.0087 4.8308 4.4793 1.2406 1.8318 2.3295 7.8517 6.8661 6.2304 3.3402 3.9595 3.5919 3.2010 4.5226 1.1138 1.6957 1.8444 7.2670 7.4214 5.9357 6.6656 6.4074 6.6678 5.5892 5.4719 6.0143 5.0143 6.7399 4.0791 4.0325 3.2420 5.8238 4.4083 6.1409 1.7565 1.4526 1.8069 2.6026 4.5307 3.3010 2.3028 1.5504 1.5269 1.3524 1.3831 2.2322 1.8453 4.1743 1.8716 2.3811 2.3694 2.3271 2.3757 2.1169 1.6375 1.4246 1.2080 1.3707 1.1762 1.5465 1.4700 2.3781 2.9957 2.6079 2.8139 2.6526 1.5213 2.0899 1.5770 1.8632 6.0671 8.3781 3.7651 5.0076 2.5193 3.0610 2.5372 3.3383 3.1828 7.3829 7.2451 6.6636 7.1905 7.1220 6.6837 12.9693 1.0905 1.0917 1.0861 1.0898 1.0883 1.0941 1.0930 1.1004 1.0963 1.0936 1.0648 1.0649 1.0666 1.0666
irintensity: 1.5519 2.1619 0.3444 0.0813 3.4400 1.8307 0.7548 1.1194 0.8508 2.2997 2.0440 3.1582 3.5558 1.9515 15.0243 5.1821 17.7138 180.6580 83.0003 35.5466 3.0215 1.4281 1.4597 0.9468 17.2307 25.4466 4.2712 7.5393 119.0775 78.9949 48.8362 8.7788 8.4043 9.9067 12.1626 10.9879 6.9072 34.2423 7.9344 5.1080 30.9003 2.2565 0.2519 7.7204 56.6079 38.5540 9.2529 11.7672 40.6231 46.9631 68.4555 7.6612 121.7558 7.1622 20.4750 20.6112 16.9560 0.3026 6.4292 29.3526 13.9957 22.6528 36.2872 60.9957 57.7215 160.2900 152.0516 56.7728 22.2074 38.0878 6.7350 28.1290 14.0928 283.3921 53.2061 79.5904 117.2240 97.7185 15.1239 165.2214 21.3526 119.4172 51.3150 9.8891 4.1407 5.7059 48.6273 44.4278 16.7794 5.3646 7.7068 145.9982 118.0364 3.1318 33.2776 28.4097 12.2951 22.5827 3.7032 409.4618 16.9755 5.7064 1.2286 7.9481 3.8198 4.1893 6.2135 20.6878 5.5771 1.4058 104.0832 93.1840 46.2167 81.2406
temp: 298.150 k
press: 1.00000 atm
elementType: 8 8 8 8 8 8 6 6 6 6 6 6 6 6 6 6 6 6 6 6 6 6 6 6 6 6 1 1 1 1 1 1 1 1 1 1 1 1 1 1
symmnumber: 1
zpe: 764735.7 jmol-1
zpe.correction: 0.291272 hartree
zpe.thermalcorrener: 0.313219 hartree
zpe.thermalcorrenthalpy: 0.314163 hartree
zpe.thermalcorrgfe: 0.239808 hartree
zpe.sumelectzpe: -1220.068629 hartree
zpe.sumelectthermal: -1220.046683 hartree
zpe.sumelectthermalent: -1220.045739 hartree
zpe.sumelectthermalfe: -1220.120094 hartree
dipole: 4.3436 -3.0000 -1.5630
dipole: 5.5055
quadrupole: -137.6567 -133.3880 -153.8232
quadrupole: -2.7132 0.7475 -28.0297
quadrupole: 3.9659 8.2346 -12.2006 -2.7132 0.7475 -28.0297
hfenergy: -1220.3599019 hartree
pointgroup: C01 [X(C20H14O6)]
dipole: 1.7724275 -1.1017628 -0.5798614 debye
polarizability: 237.1459329|6.4206675|268.0063315|15.2642687|0.650822|207.5991985 unknown
InChI: InChI=1S/C20H14O6/c21-15-7-5-11(9-17(15)23)20(12-6-8-16(22)18(24)10-12)14-4-2-1-3-13(14)19(25)26-20/h1-10,21-24H
charge 0 multiplicity 1
40 atoms
O  -0.183517 0.93538 1.765596
O  0.062258 2.966114 2.897076
O  -3.800985 -2.914324 0.674577
O  2.223521 -3.391253 -1.920313
O  -5.32266 -1.465609 -1.011957
O  4.100611 -3.576468 0.008703
C  -0.04442 0.420194 0.332528
C  0.443159 1.665094 -0.418659
C  -1.427739 -0.079341 -0.088804
C  1.038794 -0.672987 0.332296
C  0.528159 2.756185 0.469107
C  0.129057 2.324779 1.833237
C  0.805636 1.817178 -1.769362
C  -1.912557 -1.287274 0.481846
C  1.115333 -1.565731 -0.767259
C  -2.268002 0.654624 -0.959195
C  2.005121 -0.744785 1.362094
C  0.962553 4.02974 0.049446
C  1.243374 3.091368 -2.204637
C  1.319449 4.190094 -1.3075
C  -3.202623 -1.73585 0.173186
C  2.150764 -2.512579 -0.835488
C  -3.56668 0.194899 -1.273516
C  3.044495 -1.702385 1.299955
C  -4.042285 -1.00164 -0.710305
C  3.119598 -2.576273 0.202023
H  0.759937 0.975218 -2.467474
H  -1.274158 -1.855283 1.169479
H  0.368594 -1.550707 -1.567044
H  -1.918782 1.593162 -1.3989
H  1.932081 -0.072574 2.219802
H  1.017919 4.8564 0.765073
H  1.530868 3.23216 -3.252426
H  1.661731 5.163994 -1.673216
H  -4.221478 0.753716 -1.947972
H  3.786064 -1.759635 2.106515
H  -3.209929 -3.393013 1.30314
H  3.012941 -3.982675 -1.800763
H  -5.482388 -2.311549 -0.515154
H  4.767484 -3.587667 0.735766
