program: Orca
programVersion: 4.2.1
elementType: S S O O O O O O O N N N N N C C C C C C C C C H H H H H H H H H H H H H H H
charge: 0
multiplicity: 1
keywords: wb97x-d3
keywords: def2-TZVPP
keywords: def2/J RIJCOSX GRIDX6 NOFINALGRIDX
keywords: grid4 nofinalgrid
keywords: scfconv7
keywords: smallprint printgap noloewdin
keywords: NOSOSCF
formula: C9H15N5O7S2
InChI: InChI=1S/C9H15N5O7S2/c1-14(22(4,16)17)23(18,19)13-9(15)12-8-10-6(20-2)5-7(11-8)21-3/h5,12-13H,1-4H3
38 atoms
S  2.225925 0.723593 1.790111
S  2.30396 -0.667046 -0.763108
O  2.316576 2.120137 2.162293
O  0.941541 0.054655 1.811422
O  2.287232 -1.889719 0.004373
O  3.093301 -0.566525 -1.962368
O  1.045096 1.655257 -2.091576
O  -5.409656 0.806844 -0.194253
O  -2.451276 -2.596431 0.908398
N  2.793297 0.614038 0.200763
N  0.718289 -0.359539 -1.083649
N  -1.056407 1.069791 -1.509391
N  -3.232585 0.935312 -0.863907
N  -1.737497 -0.799129 -0.306164
C  3.934376 1.431441 -0.227664
C  3.398926 -0.196994 2.737712
C  0.295564 0.844133 -1.598399
C  -2.04613 0.359786 -0.861506
C  -4.19965 0.282217 -0.234953
C  -2.71407 -1.441847 0.327227
C  -4.002456 -0.939972 0.398138
C  -5.63643 2.06713 -0.819889
C  -1.117097 -3.098713 0.875311
H  3.745031 1.847504 -1.212237
H  4.862074 0.863189 -0.232492
H  4.038223 2.265144 0.460433
H  3.095589 -0.142106 3.782943
H  3.404154 -1.232699 2.407272
H  4.386821 0.244812 2.623199
H  -1.356602 1.94857 -1.911119
H  -4.796925 -1.460141 0.9130
H  -5.457803 2.022527 -1.894373
H  -6.683303 2.29772 -0.640584
H  -5.016934 2.851596 -0.3850
H  -0.421854 -2.424287 1.376271
H  -1.144423 -4.040487 1.417082
H  -0.782773 -3.290535 -0.144986
H  0.006865 -0.927698 -0.593733
elementType: S O N C H
totalener: -1948.89416119 hartree
nucrepener: 2612.98095327 hartree
electener: -4561.87511446 hartree
oneelecener: -7874.70743230 hartree
twoeener: 3312.83231784 hartree
cpcmener: -0.03873912 hartree
kineticenergy: 1942.48458088 hartree
xcener: -142.325504668155 hartree
chargesum: 0.0000000
charge: 0.826419 0.877051 -0.504342 -0.503124 -0.482599 -0.465088 -0.446607 -0.290943 -0.289230 -0.199407 -0.215782 -0.136890 -0.422787 -0.417793 -0.183563 -0.219832 0.352877 0.363577 0.414945 0.420847 -0.322951 -0.115378 -0.125779 0.124379 0.137565 0.126153 0.143007 0.137785 0.140654 0.190550 0.144175 0.113891 0.131083 0.113198 0.108667 0.138106 0.115900 0.221264
qa: 0.8264 0.8771 -0.5043 -0.5031 -0.4826 -0.4651 -0.4466 -0.2909 -0.2892 -0.1994 -0.2158 -0.1369 -0.4228 -0.4178 -0.1836 -0.2198 0.3529 0.3636 0.4149 0.4208 -0.3230 -0.1154 -0.1258 0.1244 0.1376 0.1262 0.1430 0.1378 0.1407 0.1906 0.1442 0.1139 0.1311 0.1132 0.1087 0.1381 0.1159 0.2213
va: 5.7644 6.0237 1.9793 1.9734 2.0105 2.0341 2.0663 2.1317 2.1416 3.0124 3.0897 3.1803 2.9693 2.9813 3.8769 3.8901 4.4303 4.2581 4.0264 3.9885 3.9306 3.8492 3.8445 1.0066 0.9868 1.0056 1.0080 1.0144 1.0042 1.0177 1.0166 0.9953 0.9936 0.9960 0.9989 0.9962 0.9905 1.0658
dispcorr: -0.022021957 hartree
energy: -1948.916183147413
dipole: -1.79657 1.20754 -0.58903 0.46128 -0.76336 -0.30208 5.31140 -4.04484 1.26656
magnitude: 1.42912 au
magnitude: 3.63253 debye
