program: Orca
programVersion: 5.0.2
elementType: S F F F O O O O O O N N N N N C C C C C C C C C C C C C C H H H H H H H H H H H H H H
charge: 0
multiplicity: 1
keywords: wb97x-d3
keywords: def2-TZVPP
keywords: def2/J RIJCOSX
keywords: DEFGRID2
keywords: scfconv7
keywords: smallprint printgap noloewdin
keywords: NOSOSCF
formula: C14H14F3N5O6S
InChI: InChI=1/C14H14F3N5O6S/c1-26-9-6-10(27-2)20-12(19-9)21-13(23)22-29(24,25)11-8(4-3-5-18-11)28-7-14(15,16)17/h3-6,21-22H,7H2,1-2H3
43 atoms
S  -0.982579 2.404554 -1.070236
F  -0.046356 -1.676499 1.267118
F  -2.112861 -2.086279 0.851145
F  -1.299981 -2.531692 2.797878
O  -1.624808 0.6659 1.247729
O  -1.094429 2.943255 -2.406004
O  -0.556404 3.263562 0.020002
O  -0.990877 -0.155382 -2.545363
O  3.713215 1.125084 1.385169
O  4.742549 -3.065123 -0.334937
N  0.106964 1.152508 -1.050896
N  -3.52209 1.961551 -1.487191
N  0.955837 -0.911954 -1.68588
N  2.326828 0.126653 -0.127129
N  2.846007 -1.992986 -1.018553
C  -2.553362 1.649777 -0.659162
C  -2.70987 0.860203 0.481096
C  -3.985298 0.356776 0.717661
C  -1.635478 -0.266523 2.304142
C  -5.005186 0.689305 -0.154457
C  -0.042397 0.027424 -1.811908
C  -4.736707 1.498867 -1.248039
C  -1.27376 -1.648682 1.795956
C  2.092496 -0.914304 -0.907028
C  3.437656 0.09913 0.600884
C  3.946615 -2.01289 -0.279663
C  4.315685 -0.970916 0.565434
C  2.79017 2.212418 1.442236
C  4.370999 -4.172712 -1.151077
H  0.911715 1.200101 -0.407315
H  -4.204491 -0.278834 1.563849
H  -0.871708 0.058478 3.011463
H  -2.58476 -0.301228 2.842489
H  -6.005039 0.313704 0.01409
H  -5.515822 1.77583 -1.946542
H  0.826116 -1.738233 -2.256239
H  5.219538 -0.999085 1.156695
H  3.230739 2.935739 2.123989
H  1.822442 1.897229 1.835636
H  2.655729 2.68185 0.467036
H  4.28772 -3.894625 -2.201829
H  5.169976 -4.901015 -1.036782
H  3.431568 -4.617623 -0.821392
elementType: S F O N C H
totalener: -1964.99210341 hartree
nucrepener: 3350.51528601 hartree
electener: -5315.50738942 hartree
oneelecener: -9367.08282656 hartree
twoeener: 4051.57543714 hartree
cpcmener: -0.05595797 hartree
kineticenergy: 1958.18457266 hartree
xcener: -158.188338042414 hartree
chargesum: -0.0000000
charge: 0.869247 -0.170791 -0.181570 -0.175836 -0.306903 -0.485853 -0.515722 -0.461635 -0.290199 -0.290132 -0.201379 -0.306156 -0.129017 -0.423289 -0.426986 0.032280 0.250145 -0.120514 -0.050353 -0.124483 0.348200 0.004295 0.507324 0.351258 0.412957 0.416268 -0.323412 -0.116884 -0.116060 0.225401 0.146242 0.149495 0.140160 0.163868 0.151236 0.189700 0.143183 0.137886 0.109429 0.112497 0.112127 0.130358 0.113622
qa: 0.8692 -0.1708 -0.1816 -0.1758 -0.3069 -0.4859 -0.5157 -0.4616 -0.2902 -0.2901 -0.2014 -0.3062 -0.1290 -0.4233 -0.4270 0.0323 0.2501 -0.1205 -0.0504 -0.1245 0.3482 0.0043 0.5073 0.3513 0.4130 0.4163 -0.3234 -0.1169 -0.1161 0.2254 0.1462 0.1495 0.1402 0.1639 0.1512 0.1897 0.1432 0.1379 0.1094 0.1125 0.1121 0.1304 0.1136
va: 5.8120 1.1204 1.1133 1.1351 2.0826 2.0207 1.9685 2.0570 2.1403 2.1316 3.0588 3.0649 3.1649 2.9503 2.9630 3.9538 3.9097 3.8889 3.9253 3.9071 4.4353 4.0052 4.3562 4.2528 4.0085 4.0279 3.9283 3.8448 3.8524 1.0544 1.0070 1.0005 0.9987 0.9870 0.9952 1.0186 1.0172 0.9937 0.9935 0.9958 0.9959 0.9936 0.9957
dispcorr: -0.025282677 hartree
energy: -1965.017386084687
dipole: 11.06182 -11.13602 -0.07420 0.29192 -2.99833 -2.70641 0.28405 3.09384 3.37790
magnitude: 4.32901 au
magnitude: 11.00348 debye
