program: Orca
programVersion: 5.0.2
elementType: S F F F O O O O O O N N N N N C C C C C C C C C C C C C C H H H H H H H H H H H H H H
charge: 0
multiplicity: 1
keywords: wb97x-d3
keywords: def2-TZVPP
keywords: def2/J RIJCOSX
keywords: DEFGRID2
keywords: scfconv7
keywords: smallprint printgap noloewdin
keywords: NOSOSCF
formula: C14H14F3N5O6S
InChI: InChI=1/C14H14F3N5O6S/c1-26-9-6-10(27-2)20-12(19-9)21-13(23)22-29(24,25)11-8(4-3-5-18-11)28-7-14(15,16)17/h3-6,21-22H,7H2,1-2H3
43 atoms
S  -1.068941 2.37396 -1.287261
F  -1.718745 -1.956403 1.554975
F  -0.893033 -1.819962 3.546824
F  0.329139 -1.377029 1.827399
O  -1.398011 0.804189 1.185787
O  -1.326786 2.854085 -2.624514
O  -0.576168 3.287544 -0.272883
O  -1.062131 -0.167219 -2.790669
O  3.46409 0.96157 1.383805
O  4.458412 -3.247414 -0.313109
N  0.061941 1.159788 -1.329578
N  -3.604461 1.728536 -1.464422
N  0.867764 -0.937565 -1.908093
N  2.177115 0.049318 -0.264249
N  2.666033 -2.090363 -1.122804
C  -2.553738 1.564342 -0.696524
C  -2.557333 0.864304 0.512725
C  -3.766881 0.292469 0.895873
C  -1.317099 0.204877 2.458125
C  -4.873636 0.471764 0.086278
C  -0.112641 0.015823 -2.059427
C  -4.755881 1.199508 -1.088203
C  -0.89906 -1.247848 2.339315
C  1.951934 -0.981891 -1.058869
C  3.214421 -0.039768 0.560426
C  3.704563 -2.163267 -0.302587
C  4.044247 -1.148322 0.585901
C  2.578345 2.079576 1.395475
C  4.114353 -4.317483 -1.188738
H  0.845556 1.19163 -0.660774
H  -3.872219 -0.284498 1.803808
H  -0.549443 0.745998 3.012855
H  -2.245894 0.281311 3.027275
H  -5.823819 0.038547 0.366669
H  -5.606035 1.354587 -1.739911
H  0.734427 -1.766157 -2.474146
H  4.890095 -1.223202 1.253889
H  2.965503 2.752468 2.156413
H  1.562696 1.786307 1.664848
H  2.567222 2.598193 0.436238
H  3.12698 -4.721198 -0.963759
H  4.147247 -4.012028 -2.234864
H  4.862735 -5.087255 -1.018287
elementType: S F O N C H
totalener: -1964.99286306 hartree
nucrepener: 3359.49735672 hartree
electener: -5324.49021978 hartree
oneelecener: -9384.66879570 hartree
twoeener: 4060.17857592 hartree
cpcmener: -0.05648210 hartree
kineticenergy: 1958.19015644 hartree
xcener: -158.189143694497 hartree
chargesum: 0.0000000
charge: 0.870650 -0.182837 -0.176287 -0.171557 -0.305086 -0.484842 -0.513640 -0.460078 -0.289653 -0.290323 -0.209588 -0.304741 -0.138508 -0.424166 -0.428339 0.011266 0.281624 -0.122519 -0.059151 -0.134395 0.359954 0.005437 0.506225 0.361308 0.407880 0.417021 -0.321153 -0.104171 -0.115117 0.225237 0.140963 0.152241 0.148002 0.163949 0.151809 0.189358 0.142279 0.137584 0.091509 0.116793 0.112991 0.111655 0.130418
qa: 0.8707 -0.1828 -0.1763 -0.1716 -0.3051 -0.4848 -0.5136 -0.4601 -0.2897 -0.2903 -0.2096 -0.3047 -0.1385 -0.4242 -0.4283 0.0113 0.2816 -0.1225 -0.0592 -0.1344 0.3600 0.0054 0.5062 0.3613 0.4079 0.4170 -0.3212 -0.1042 -0.1151 0.2252 0.1410 0.1522 0.1480 0.1639 0.1518 0.1894 0.1423 0.1376 0.0915 0.1168 0.1130 0.1117 0.1304
va: 5.8210 1.1143 1.1338 1.1186 2.0787 2.0225 1.9737 2.0585 2.1395 2.1319 3.0575 3.0612 3.1713 2.9505 2.9636 3.9689 3.8918 3.8896 3.9061 3.9212 4.4297 4.0029 4.3717 4.2552 3.9982 4.0273 3.9322 3.8474 3.8526 1.0569 1.0138 0.9943 1.0006 0.9873 0.9951 1.0188 1.0174 0.9947 0.9916 0.9957 0.9960 0.9961 0.9935
dispcorr: -0.025687876 hartree
energy: -1965.018550938602
dipole: 9.28338 -9.15551 0.12787 -1.27453 -1.22958 -2.50411 -1.74472 5.35149 3.60677
magnitude: 4.39268 au
magnitude: 11.16532 debye
