program: Orca
programVersion: 5.0.2
elementType: S F F F O O O O O O N N N N N C C C C C C C C C C C C C C H H H H H H H H H H H H H H
charge: 0
multiplicity: 1
keywords: wb97x-d3
keywords: def2-TZVPP
keywords: def2/J RIJCOSX
keywords: DEFGRID2
keywords: scfconv7
keywords: smallprint printgap noloewdin
keywords: NOSOSCF
formula: C14H14F3N5O6S
InChI: InChI=1/C14H14F3N5O6S/c1-26-9-6-10(27-2)20-12(19-9)21-13(23)22-29(24,25)11-8(4-3-5-18-11)28-7-14(15,16)17/h3-6,21-22H,7H2,1-2H3
43 atoms
S  -1.171785 2.280358 -1.041683
F  0.173429 -1.405579 1.777339
F  -0.863423 -1.9516 3.587565
F  -0.25444 0.091206 3.261678
O  -1.901709 0.259939 1.046106
O  -1.229201 2.980832 -2.30296
O  -0.849765 3.001542 0.176261
O  -0.922048 -0.001601 -2.896657
O  3.410966 0.837581 1.55728
O  4.564241 -3.17999 -0.467617
N  -0.034777 1.075178 -1.107553
N  -3.653283 1.770499 -1.683968
N  0.965908 -0.827937 -1.972877
N  2.182359 0.033431 -0.19028
N  2.76968 -1.997778 -1.231081
C  -2.728067 1.424805 -0.82106
C  -2.932022 0.536913 0.237937
C  -4.208482 -0.005454 0.359533
C  -2.083578 -0.746913 2.017955
C  -5.180758 0.361715 -0.552582
C  -0.055872 0.088167 -2.052461
C  -4.864581 1.253525 -1.565526
C  -0.741204 -0.996715 2.660061
C  2.017723 -0.923007 -1.087026
C  3.203354 -0.097524 0.649625
C  3.780985 -2.120443 -0.383342
C  4.063327 -1.182206 0.603412
C  2.551858 1.975662 1.585766
C  4.281254 -4.166385 -1.455747
H  0.724993 1.0713 -0.410953
H  -4.45838 -0.69935 1.150737
H  -2.796507 -0.438791 2.788924
H  -2.433452 -1.681808 1.569445
H  -6.179274 -0.045725 -0.474184
H  -5.603324 1.558298 -2.295481
H  0.912091 -1.576445 -2.652104
H  4.893193 -1.291935 1.286412
H  1.517513 1.697545 1.787026
H  2.604542 2.543958 0.656462
H  2.914395 2.596087 2.401435
H  4.34365 -3.758635 -2.464956
H  5.04329 -4.93171 -1.332115
H  3.297632 -4.613563 -1.309931
elementType: S F O N C H
totalener: -1964.99498618 hartree
nucrepener: 3330.87338135 hartree
electener: -5295.86836754 hartree
oneelecener: -9327.80246291 hartree
twoeener: 4031.93409537 hartree
cpcmener: -0.05609164 hartree
kineticenergy: 1958.20905964 hartree
xcener: -158.192686137492 hartree
chargesum: -0.0000000
charge: 0.871391 -0.173772 -0.176272 -0.180643 -0.303636 -0.484528 -0.512945 -0.464769 -0.288336 -0.290755 -0.207287 -0.302874 -0.140545 -0.425548 -0.430753 0.000440 0.300742 -0.139407 -0.035199 -0.135366 0.367422 0.007659 0.501435 0.363876 0.411548 0.416829 -0.321350 -0.110748 -0.114518 0.220280 0.145419 0.144142 0.136900 0.163466 0.151451 0.189005 0.142802 0.093581 0.118876 0.137901 0.111798 0.130131 0.112158
qa: 0.8714 -0.1738 -0.1763 -0.1806 -0.3036 -0.4845 -0.5129 -0.4648 -0.2883 -0.2908 -0.2073 -0.3029 -0.1405 -0.4255 -0.4308 0.0004 0.3007 -0.1394 -0.0352 -0.1354 0.3674 0.0077 0.5014 0.3639 0.4115 0.4168 -0.3214 -0.1107 -0.1145 0.2203 0.1454 0.1441 0.1369 0.1635 0.1515 0.1890 0.1428 0.0936 0.1189 0.1379 0.1118 0.1301 0.1122
va: 5.8162 1.1218 1.1327 1.1198 2.1016 2.0231 1.9733 2.0551 2.1391 2.1319 3.0585 3.0598 3.1732 2.9434 2.9627 3.9940 3.8951 3.8898 3.8857 3.9318 4.4267 4.0005 4.4013 4.2557 3.9924 4.0273 3.9360 3.8436 3.8530 1.0597 1.0067 0.9939 0.9970 0.9877 0.9951 1.0191 1.0172 0.9988 0.9945 0.9941 0.9961 0.9937 0.9961
dispcorr: -0.024566822 hartree
energy: -1965.019553005121
dipole: 5.57293 -6.36202 -0.78909 -6.18330 2.53578 -3.64752 -7.39913 9.63790 2.23877
magnitude: 4.35191 au
magnitude: 11.06168 debye
