program: Orca
programVersion: 5.0.2
elementType: S F F F O O O O O O N N N N N C C C C C C C C C C C C C C H H H H H H H H H H H H H H
charge: 0
multiplicity: 1
keywords: wb97x-d3
keywords: def2-TZVPP
keywords: def2/J RIJCOSX
keywords: DEFGRID2
keywords: scfconv7
keywords: smallprint printgap noloewdin
keywords: NOSOSCF
formula: C14H14F3N5O6S
InChI: InChI=1/C14H14F3N5O6S/c1-26-9-6-10(27-2)20-12(19-9)21-13(23)22-29(24,25)11-8(4-3-5-18-11)28-7-14(15,16)17/h3-6,21-22H,7H2,1-2H3
43 atoms
S  -0.756287 0.813181 2.569102
F  -0.723883 -2.687168 -0.62023
F  -0.41464 -1.071309 -2.006189
F  -1.728668 -2.696768 -2.525824
O  -2.052515 -0.489108 0.197619
O  -0.455968 1.884292 3.489323
O  -0.732829 -0.563668 3.027652
O  -0.190112 2.926766 0.596573
O  4.303527 -0.096426 -3.49656
O  2.891389 -2.527552 0.198687
N  0.313722 0.830903 1.301039
N  -3.032946 2.084359 2.47702
N  1.342595 1.744476 -0.565979
N  2.83109 0.832569 -2.021959
N  2.113389 -0.408878 -0.150413
C  -2.356525 1.156841 1.843287
C  -2.852248 0.421261 0.764503
C  -4.150539 0.710167 0.356369
C  -2.520268 -1.182753 -0.938857
C  -4.859765 1.690308 1.026746
C  0.446776 1.903027 0.464456
C  -4.265086 2.360104 2.084723
C  -1.332527 -1.913067 -1.519968
C  2.129589 0.668112 -0.916257
C  3.57884 -0.195391 -2.397143
C  2.868816 -1.431694 -0.536379
C  3.641813 -1.388056 -1.685049
C  4.264428 1.119529 -4.238536
C  2.188229 -2.543186 1.439701
H  0.849279 -0.024587 1.091764
H  -4.616555 0.182637 -0.464768
H  -3.297477 -1.905271 -0.672895
H  -2.91508 -0.504246 -1.701126
H  -5.870749 1.928992 0.726662
H  -4.793052 3.131821 2.629882
H  1.411652 2.542053 -1.185623
H  4.257317 -2.21833 -2.000141
H  4.621043 1.964891 -3.649042
H  3.261326 1.336902 -4.606961
H  4.930661 0.968637 -5.084188
H  2.563523 -1.780454 2.123405
H  1.114731 -2.41378 1.305088
H  2.372796 -3.525381 1.868312
elementType: S F O N C H
totalener: -1964.99413214 hartree
nucrepener: 3348.42761481 hartree
electener: -5313.42174695 hartree
oneelecener: -9362.97104924 hartree
twoeener: 4049.54930229 hartree
cpcmener: -0.05578077 hartree
kineticenergy: 1958.20171568 hartree
xcener: -158.191112873563 hartree
chargesum: 0.0000000
charge: 0.870743 -0.178267 -0.177465 -0.175091 -0.302092 -0.485038 -0.513295 -0.463782 -0.290738 -0.288231 -0.205227 -0.302570 -0.137102 -0.428692 -0.422650 -0.001819 0.303712 -0.138598 -0.032843 -0.135227 0.363384 0.007672 0.499507 0.357728 0.416085 0.405725 -0.317723 -0.115446 -0.114210 0.221015 0.144746 0.146596 0.133850 0.163002 0.151620 0.189166 0.142996 0.112547 0.112287 0.129976 0.119557 0.096400 0.137794
qa: 0.8707 -0.1783 -0.1775 -0.1751 -0.3021 -0.4850 -0.5133 -0.4638 -0.2907 -0.2882 -0.2052 -0.3026 -0.1371 -0.4287 -0.4227 -0.0018 0.3037 -0.1386 -0.0328 -0.1352 0.3634 0.0077 0.4995 0.3577 0.4161 0.4057 -0.3177 -0.1154 -0.1142 0.2210 0.1447 0.1466 0.1338 0.1630 0.1516 0.1892 0.1430 0.1125 0.1123 0.1300 0.1196 0.0964 0.1378
va: 5.8113 1.1207 1.1166 1.1347 2.1044 2.0207 1.9720 2.0549 2.1320 2.1369 3.0602 3.0637 3.1721 2.9595 2.9404 3.9889 3.8949 3.8932 3.8889 3.9297 4.4288 3.9999 4.3958 4.2514 4.0254 3.9953 3.9375 3.8535 3.8422 1.0592 1.0069 0.9946 0.9974 0.9878 0.9951 1.0190 1.0171 0.9959 0.9958 0.9937 0.9937 0.9987 0.9940
dispcorr: -0.025040835 hartree
energy: -1965.019172976526
dipole: 6.48071 -7.98885 -1.50814 5.49115 -6.77930 -1.28815 -4.31976 0.48532 -3.83443
magnitude: 4.31702 au
magnitude: 10.97300 debye
