program: Orca
programVersion: 5.0.2
elementType: S F F F O O O O O O N N N N N C C C C C C C C C C C C C C H H H H H H H H H H H H H H
charge: 0
multiplicity: 1
keywords: wb97x-d3
keywords: def2-TZVPP
keywords: def2/J RIJCOSX
keywords: DEFGRID2
keywords: scfconv7
keywords: smallprint printgap noloewdin
keywords: NOSOSCF
formula: C14H14F3N5O6S
InChI: InChI=1/C14H14F3N5O6S/c1-26-9-6-10(27-2)20-12(19-9)21-13(23)22-29(24,25)11-8(4-3-5-18-11)28-7-14(15,16)17/h3-6,21-22H,7H2,1-2H3
43 atoms
S  -0.949429 2.258178 -1.315386
F  -1.131014 0.351206 3.531147
F  -1.518903 -1.764097 3.695696
F  -3.08256 -0.412617 3.069231
O  -1.554068 0.270389 0.773405
O  -1.00782 2.934221 -2.589514
O  -0.73378 3.017228 -0.09859
O  -0.379639 0.058498 -3.20765
O  3.132854 0.629771 1.965058
O  5.005549 -2.928846 -0.352274
N  0.282132 1.144095 -1.323816
N  -3.33794 1.483444 -2.07333
N  1.407793 -0.73662 -2.083725
N  2.257748 -0.022872 -0.041103
N  3.200937 -1.834215 -1.220924
C  -2.427485 1.261153 -1.155157
C  -2.56565 0.352458 -0.104773
C  -3.742751 -0.388119 -0.071176
C  -1.338975 -0.898315 1.532707
C  -4.696591 -0.161544 -1.046859
C  0.379552 0.158663 -2.268033
C  -4.463037 0.790748 -2.028355
C  -1.774698 -0.674159 2.965621
C  2.325803 -0.858379 -1.063555
C  3.158589 -0.180123 0.924103
C  4.096332 -1.976994 -0.254064
C  4.130138 -1.165834 0.875006
C  2.134862 1.646609 2.02995
C  5.00803 -3.766704 -1.504416
H  0.901986 1.090891 -0.503319
H  -3.938521 -1.121403 0.69869
H  -1.848361 -1.773392 1.121566
H  -0.266605 -1.102167 1.517531
H  -5.62229 -0.720103 -1.040151
H  -5.196919 0.99516 -2.797156
H  1.489957 -1.430901 -2.815555
H  4.864592 -1.293053 1.657176
H  1.129448 1.225524 2.054998
H  2.217439 2.348859 1.199857
H  2.317576 2.176394 2.96151
H  4.081509 -4.334456 -1.594175
H  5.169336 -3.195164 -2.418745
H  5.836571 -4.45599 -1.363363
elementType: S F O N C H
totalener: -1964.99372749 hartree
nucrepener: 3287.62675040 hartree
electener: -5252.62047789 hartree
oneelecener: -9239.98237616 hartree
twoeener: 3987.36189828 hartree
cpcmener: -0.05728637 hartree
kineticenergy: 1958.19500554 hartree
xcener: -158.189151621088 hartree
chargesum: 0.0000000
charge: 0.870708 -0.176187 -0.178459 -0.179110 -0.320837 -0.483007 -0.511306 -0.459941 -0.289572 -0.289844 -0.209632 -0.305200 -0.144674 -0.435112 -0.432851 0.026131 0.260354 -0.112482 -0.039151 -0.136786 0.363490 0.008906 0.504953 0.375927 0.412299 0.416294 -0.320094 -0.102295 -0.115793 0.225573 0.140211 0.151421 0.140124 0.163539 0.151781 0.189104 0.142737 0.088853 0.116305 0.137767 0.111949 0.112923 0.130984
qa: 0.8707 -0.1762 -0.1785 -0.1791 -0.3208 -0.4830 -0.5113 -0.4599 -0.2896 -0.2898 -0.2096 -0.3052 -0.1447 -0.4351 -0.4329 0.0261 0.2604 -0.1125 -0.0392 -0.1368 0.3635 0.0089 0.5050 0.3759 0.4123 0.4163 -0.3201 -0.1023 -0.1158 0.2256 0.1402 0.1514 0.1401 0.1635 0.1518 0.1891 0.1427 0.0889 0.1163 0.1378 0.1119 0.1129 0.1310
va: 5.8240 1.1196 1.1299 1.1197 2.0428 2.0247 1.9753 2.0583 2.1406 2.1321 3.0636 3.0613 3.1735 2.9521 2.9669 3.9795 3.9078 3.8961 3.8535 3.9247 4.4255 4.0021 4.4197 4.2435 3.9977 4.0269 3.9290 3.8449 3.8522 1.0523 1.0163 1.0035 1.0111 0.9876 0.9949 1.0191 1.0174 0.9972 0.9966 0.9948 0.9956 0.9959 0.9937
dispcorr: -0.024926913 hartree
energy: -1965.018654398262
dipole: 15.88851 -15.29371 0.59481 -9.66124 5.37815 -4.28309 -10.53076 12.25468 1.72392
magnitude: 4.65517 au
magnitude: 11.83250 debye
