program: Orca
programVersion: 5.0.2
elementType: S F F F O O O O O O N N N N N C C C C C C C C C C C C C C H H H H H H H H H H H H H H
charge: 0
multiplicity: 1
keywords: wb97x-d3
keywords: def2-TZVPP
keywords: def2/J RIJCOSX
keywords: DEFGRID2
keywords: scfconv7
keywords: smallprint printgap noloewdin
keywords: NOSOSCF
formula: C14H14F3N5O6S
InChI: InChI=1/C14H14F3N5O6S/c1-26-9-6-10(27-2)20-12(19-9)21-13(23)22-29(24,25)11-8(4-3-5-18-11)28-7-14(15,16)17/h3-6,21-22H,7H2,1-2H3
43 atoms
S  -0.786076 2.584005 0.538274
F  -2.04312 -0.738863 -2.787199
F  -3.72977 -1.215283 -1.550052
F  -2.484909 -2.799472 -2.323864
O  -1.50395 -0.174541 -0.134857
O  -1.092877 2.68851 -0.876417
O  -0.625478 3.778707 1.332477
O  0.69327 1.486019 2.848184
O  2.240307 -0.293501 -2.959607
O  4.85605 -2.931103 -0.175528
N  0.605088 1.674849 0.58603
N  -2.64853 2.12904 2.331417
N  2.103273 0.228162 1.614077
N  2.159218 -0.009826 -0.696371
N  3.481877 -1.347378 0.72424
C  -2.013358 1.554227 1.338791
C  -2.27401 0.264848 0.870011
C  -3.2840 -0.441438 1.515004
C  -1.572532 -1.499676 -0.603811
C  -3.951121 0.166812 2.563024
C  1.101037 1.16129 1.753991
C  -3.605671 1.454349 2.945424
C  -2.467368 -1.561575 -1.823702
C  2.597783 -0.395813 0.489126
C  2.65238 -0.642142 -1.756277
C  3.967989 -1.968584 -0.340898
C  3.58666 -1.657951 -1.641537
C  1.27403 0.748489 -3.084921
C  5.237354 -3.298358 1.146936
H  0.94629 1.268031 -0.297056
H  -3.563363 -1.44443 1.224031
H  -0.559893 -1.785817 -0.892225
H  -1.911323 -2.211369 0.152133
H  -4.740592 -0.360905 3.080143
H  -4.110549 1.950284 3.764316
H  2.470529 -0.120118 2.490836
H  3.988661 -2.173388 -2.501761
H  1.648268 1.695445 -2.694902
H  0.338063 0.49261 -2.588993
H  1.091464 0.851812 -4.15159
H  4.386976 -3.660357 1.725605
H  5.958696 -4.103205 1.030503
H  5.707262 -2.470604 1.678684
elementType: S F O N C H
totalener: -1964.99322570 hartree
nucrepener: 3312.60640664 hartree
electener: -5277.59963234 hartree
oneelecener: -9290.12683690 hartree
twoeener: 4012.52720456 hartree
cpcmener: -0.05772497 hartree
kineticenergy: 1958.21213688 hartree
xcener: -158.192607855055 hartree
chargesum: 0.0000000
charge: 0.873467 -0.175183 -0.178329 -0.177182 -0.309684 -0.511808 -0.483589 -0.456161 -0.289447 -0.290139 -0.210420 -0.302213 -0.144044 -0.430901 -0.431389 -0.005050 0.288667 -0.117910 -0.050432 -0.130768 0.357033 0.005820 0.504480 0.371440 0.412644 0.417295 -0.321792 -0.103554 -0.116390 0.226126 0.140328 0.143721 0.150281 0.163140 0.151142 0.188730 0.143060 0.120426 0.084298 0.137893 0.113068 0.130904 0.112424
qa: 0.8735 -0.1752 -0.1783 -0.1772 -0.3097 -0.5118 -0.4836 -0.4562 -0.2894 -0.2901 -0.2104 -0.3022 -0.1440 -0.4309 -0.4314 -0.0051 0.2887 -0.1179 -0.0504 -0.1308 0.3570 0.0058 0.5045 0.3714 0.4126 0.4173 -0.3218 -0.1036 -0.1164 0.2261 0.1403 0.1437 0.1503 0.1631 0.1511 0.1887 0.1431 0.1204 0.0843 0.1379 0.1131 0.1309 0.1124
va: 5.8187 1.1189 1.1197 1.1323 2.0593 1.9761 2.0231 2.0613 2.1397 2.1319 3.0620 3.0595 3.1719 2.9511 2.9652 3.9964 3.8827 3.9002 3.8835 3.9155 4.4301 4.0008 4.4108 4.2514 3.9915 4.0257 3.9319 3.8434 3.8519 1.0554 1.0130 1.0061 1.0018 0.9875 0.9952 1.0191 1.0172 0.9949 0.9987 0.9951 0.9958 0.9937 0.9957
dispcorr: -0.025311258 hartree
energy: -1965.018536953987
dipole: 18.76059 -18.14512 0.61547 -7.32562 2.35052 -4.97510 8.13280 -8.14975 -0.01695
magnitude: 5.01305 au
magnitude: 12.74216 debye
