program: Orca
programVersion: 5.0.2
elementType: S F F F O O O O O O N N N N N C C C C C C C C C C C C C C H H H H H H H H H H H H H H
charge: 0
multiplicity: 1
keywords: wb97x-d3
keywords: def2-TZVPP
keywords: def2/J RIJCOSX
keywords: DEFGRID2
keywords: scfconv7
keywords: smallprint printgap noloewdin
keywords: NOSOSCF
formula: C14H14F3N5O6S
InChI: InChI=1/C14H14F3N5O6S/c1-26-9-6-10(27-2)20-12(19-9)21-13(23)22-29(24,25)11-8(4-3-5-18-11)28-7-14(15,16)17/h3-6,21-22H,7H2,1-2H3
43 atoms
S  -0.735411 0.219643 -0.932759
F  -6.459752 -0.922003 -1.491918
F  -6.176108 1.170339 -1.058788
F  -6.128426 -0.269292 0.538313
O  -3.569801 0.736237 -0.245245
O  -1.456136 -0.652943 -1.827047
O  -0.542547 1.621025 -1.233818
O  0.303302 -2.527757 -0.186057
O  4.212447 2.37764 -0.573743
O  6.906075 -1.198868 0.657134
N  0.797313 -0.352363 -0.68503
N  -0.684172 -0.18735 1.700099
N  2.447773 -1.839568 -0.020391
N  3.312995 0.299179 -0.300595
N  4.674471 -1.524568 0.318939
C  -1.482279 0.095311 0.698899
C  -2.84328 0.357391 0.830114
C  -3.380386 0.293687 2.107043
C  -4.288688 -0.249812 -0.958015
C  -2.545385 -0.021728 3.166164
C  1.097994 -1.633872 -0.291798
C  -1.202305 -0.254329 2.916262
C  -5.775127 -0.056995 -0.737873
C  3.515885 -0.97509 -0.004151
C  4.371364 1.101679 -0.278935
C  5.719831 -0.711531 0.340245
C  5.638267 0.64469 0.043161
C  2.916095 2.845592 -0.922794
C  7.012277 -2.581251 0.957354
H  1.551449 0.34225 -0.627227
H  -4.427739 0.507009 2.267002
H  -4.066517 -0.134353 -2.019416
H  -4.004391 -1.264643 -0.668685
H  -2.930731 -0.078113 4.174613
H  -0.518172 -0.496477 3.719793
H  2.670078 -2.788768 0.239105
H  6.500489 1.293094 0.059536
H  2.52666 2.346742 -1.811008
H  3.034105 3.904609 -1.133758
H  2.202598 2.721908 -0.107256
H  6.717061 -3.20322 0.111904
H  8.061389 -2.751851 1.183648
H  6.40474 -2.85647 1.81987
totalener: -1964.96270328 hartree
nucrepener: 3144.62530822 hartree
electener: -5109.58801150 hartree
oneelecener: -8954.93737821 hartree
twoeener: 3845.34936671 hartree
kineticenergy: 1958.27710784 hartree
xcener: -158.194157622510 hartree
chargesum: 0.0000000
charge: 0.860107 -0.169526 -0.162603 -0.182932 -0.319265 -0.442117 -0.462218 -0.353937 -0.260817 -0.262167 -0.205023 -0.304252 -0.170385 -0.431296 -0.413925 0.215884 0.054105 -0.089463 -0.039292 -0.112077 0.331738 0.013153 0.490266 0.370248 0.402801 0.389627 -0.302937 -0.125866 -0.123214 0.190093 0.137959 0.128838 0.118886 0.134496 0.119690 0.166694 0.128014 0.109929 0.126675 0.106478 0.108265 0.122880 0.106490
qa: 0.8601 -0.1695 -0.1626 -0.1829 -0.3193 -0.4421 -0.4622 -0.3539 -0.2608 -0.2622 -0.2050 -0.3043 -0.1704 -0.4313 -0.4139 0.2159 0.0541 -0.0895 -0.0393 -0.1121 0.3317 0.0132 0.4903 0.3702 0.4028 0.3896 -0.3029 -0.1259 -0.1232 0.1901 0.1380 0.1288 0.1189 0.1345 0.1197 0.1667 0.1280 0.1099 0.1267 0.1065 0.1083 0.1229 0.1065
va: 5.7940 1.1397 1.1464 1.1112 2.0329 2.0462 2.0264 2.1669 2.1627 2.1519 3.0809 3.0221 3.1649 2.9786 2.9725 3.8505 4.0863 3.9679 3.9146 3.9084 4.4292 4.0565 4.4425 4.2485 4.0178 4.0565 3.9342 3.8691 3.8781 1.0893 1.0142 1.0096 1.0028 0.9984 1.0009 1.0361 1.0223 0.9971 0.9966 0.9974 0.9972 0.9943 0.9973
dispcorr: -0.022792185 hartree
energy: -1964.985495466752
dipole: 40.03550 -38.46858 1.56692 -1.00880 0.85572 -0.15308 8.77020 -7.04667 1.72353
magnitude: 2.33436 au
magnitude: 5.93346 debye
