program: Orca
programVersion: 5.0.2
elementType: S F F F O O O O O N N N N C C C C C C C C C C C C C C H H H H H H H H H H H H H
charge: 0
multiplicity: 1
keywords: wb97x-d3
keywords: def2-TZVPP
keywords: def2/J RIJCOSX
keywords: DEFGRID2
keywords: scfconv7
keywords: smallprint printgap noloewdin
keywords: NOSOSCF
formula: C14H13F3N4O5S
InChI: InChI=1/C14H13F3N4O5S/c1-21(27(23,24)12(16)17)9-7(5-4-6-8(9)15)10(22)11-18-13(25-2)20-14(19-11)26-3/h4-6,12H,1-3H3
40 atoms
S  0.259822 1.832898 -0.595488
F  3.201756 0.910041 1.566493
F  1.330989 3.649515 0.90647
F  2.661071 2.773192 -0.586837
O  -1.042763 2.326721 -0.198626
O  0.516225 1.345061 -1.936696
O  0.181959 -1.904864 -2.59655
O  -2.358541 -2.167024 2.354129
O  -4.060504 0.131108 -1.113952
N  0.709064 0.662731 0.467835
N  -1.991201 -0.653497 -1.286974
N  -1.03656 -1.823198 0.522878
N  -3.240597 -1.009008 0.681442
C  1.758317 -0.221948 0.116198
C  1.564532 -1.261466 -0.797517
C  3.010435 -0.084552 0.697866
C  0.266326 0.749459 1.866366
C  1.422021 3.234309 -0.363835
C  2.623709 -2.099958 -1.13049
C  0.260086 -1.483447 -1.468169
C  4.05726 -0.933628 0.406449
C  3.85628 -1.945746 -0.518605
C  -1.009353 -1.27655 -0.681195
C  -2.188906 -1.662847 1.156887
C  -3.087838 -0.528757 -0.534956
C  -1.284416 -2.88685 2.963633
C  -5.278172 0.346827 -0.398814
H  0.76428 1.538718 2.424429
H  0.485178 -0.202603 2.341323
H  -0.808702 0.902502 1.909171
H  1.174244 4.041344 -1.056178
H  2.474257 -2.896829 -1.846001
H  5.016445 -0.793318 0.88716
H  4.668601 -2.61586 -0.762758
H  -1.030352 -3.778788 2.392625
H  -1.64956 -3.178872 3.943732
H  -0.400647 -2.2608 3.077927
H  -5.108352 0.928455 0.505877
H  -5.762229 -0.594473 -0.143569
H  -5.915953 0.909291 -1.074117
elementType: S F O N C H
totalener: -1834.32860191 hartree
nucrepener: 3065.71674213 hartree
electener: -4900.04534404 hartree
oneelecener: -8621.26064438 hartree
twoeener: 3721.21530034 hartree
cpcmener: -0.05486822 hartree
kineticenergy: 1828.04359955 hartree
xcener: -146.964545064539 hartree
chargesum: -0.0000000
charge: 0.841318 -0.207453 -0.179274 -0.176191 -0.507812 -0.497419 -0.378539 -0.279795 -0.278577 -0.086774 -0.325922 -0.395779 -0.380556 0.016102 -0.025755 0.227145 -0.224388 0.272343 -0.106974 0.224518 -0.131555 -0.142189 0.234329 0.451468 0.482203 -0.117176 -0.116293 0.145848 0.144637 0.133477 0.169601 0.147446 0.155780 0.168190 0.121123 0.134428 0.117693 0.119629 0.118759 0.132386
qa: 0.8413 -0.2075 -0.1793 -0.1762 -0.5078 -0.4974 -0.3785 -0.2798 -0.2786 -0.0868 -0.3259 -0.3958 -0.3806 0.0161 -0.0258 0.2271 -0.2244 0.2723 -0.1070 0.2245 -0.1316 -0.1422 0.2343 0.4515 0.4822 -0.1172 -0.1163 0.1458 0.1446 0.1335 0.1696 0.1474 0.1558 0.1682 0.1211 0.1344 0.1177 0.1196 0.1188 0.1324
va: 5.7377 1.0837 1.1201 1.1254 1.9912 1.9918 2.0952 2.1334 2.1347 2.9793 2.9817 2.9400 2.9216 3.8373 3.5810 3.9691 3.8817 4.1406 3.9254 3.9877 3.9364 3.9115 4.0170 4.2369 4.1847 3.8476 3.8442 1.0044 0.9763 1.0003 0.9784 1.0104 0.9966 0.9865 0.9944 0.9939 0.9871 0.9948 0.9952 0.9943
dispcorr: -0.026045373 hartree
energy: -1834.354647282023
dipole: -13.09107 14.55670 1.46563 -14.96573 14.39927 -0.56646 10.16328 -6.83644 3.32684
magnitude: 3.67924 au
magnitude: 9.35189 debye
