program: Orca
programVersion: 5.0.2
elementType: S F F F O O O O O N N N N C C C C C C C C C C C C C C H H H H H H H H H H H H H
charge: 0
multiplicity: 1
keywords: wb97x-d3
keywords: def2-TZVPP
keywords: def2/J RIJCOSX
keywords: DEFGRID2
keywords: scfconv7
keywords: smallprint printgap noloewdin
keywords: NOSOSCF
formula: C14H13F3N4O5S
InChI: InChI=1/C14H13F3N4O5S/c1-21(27(23,24)12(16)17)9-7(5-4-6-8(9)15)10(22)11-18-13(25-2)20-14(19-11)26-3/h4-6,12H,1-3H3
40 atoms
S  0.65241 1.277123 -1.194783
F  2.621216 1.644291 2.010105
F  1.333671 3.66682 -0.474992
F  2.995684 2.291286 -0.815187
O  -0.645813 1.807084 -1.560298
O  1.293567 0.224684 -1.958761
O  0.713936 -2.949367 -1.10954
O  -3.545633 -0.438213 -2.114867
O  -3.108576 -0.999676 2.32221
N  0.592264 0.791612 0.374516
N  -1.366077 -1.461591 1.025506
N  -1.567651 -1.253741 -1.313793
N  -3.382826 -0.691148 0.080207
C  1.582147 -0.103068 0.851551
C  1.560878 -1.460226 0.516383
C  2.593978 0.350791 1.684753
C  -0.262627 1.51311 1.327593
C  1.80592 2.70147 -1.275553
C  2.564102 -2.306158 0.976672
C  0.50363 -2.033351 -0.352015
C  3.571463 -0.486464 2.180829
C  3.553848 -1.822806 1.815976
C  -0.906068 -1.521186 -0.201882
C  -2.797435 -0.807373 -1.105176
C  -2.633296 -1.04561 1.102212
C  -3.010443 -0.496838 -3.439316
C  -4.451398 -0.558235 2.529022
H  -0.337164 0.908127 2.22597
H  -1.262931 1.628572 0.919474
H  0.130186 2.490565 1.59661
H  1.886427 3.055392 -2.30596
H  2.55261 -3.352479 0.704551
H  4.341822 -0.090953 2.829628
H  4.319197 -2.488577 2.189403
H  -3.79765 -0.122014 -4.086785
H  -2.765171 -1.518613 -3.724207
H  -2.128956 0.134271 -3.539742
H  -5.165763 -1.207695 2.025259
H  -4.587861 0.468091 2.191219
H  -4.612144 -0.609188 3.601772
elementType: S F O N C H
totalener: -1834.32835691 hartree
nucrepener: 3068.49311384 hartree
electener: -4902.82147075 hartree
oneelecener: -8626.96886844 hartree
twoeener: 3724.14739770 hartree
cpcmener: -0.04703295 hartree
kineticenergy: 1828.04525108 hartree
xcener: -146.964975216948 hartree
chargesum: 0.0000000
charge: 0.842045 -0.207592 -0.179328 -0.175834 -0.510440 -0.499329 -0.381331 -0.279065 -0.282587 -0.082743 -0.358778 -0.369488 -0.382092 0.024813 -0.028791 0.229157 -0.214306 0.273144 -0.110658 0.243544 -0.134595 -0.142945 0.228526 0.454394 0.485783 -0.111915 -0.118238 0.135426 0.132383 0.144492 0.168524 0.147515 0.155755 0.168282 0.133641 0.119656 0.110980 0.120087 0.119317 0.132593
qa: 0.8420 -0.2076 -0.1793 -0.1758 -0.5104 -0.4993 -0.3813 -0.2791 -0.2826 -0.0827 -0.3588 -0.3695 -0.3821 0.0248 -0.0288 0.2292 -0.2143 0.2731 -0.1107 0.2435 -0.1346 -0.1429 0.2285 0.4544 0.4858 -0.1119 -0.1182 0.1354 0.1324 0.1445 0.1685 0.1475 0.1558 0.1683 0.1336 0.1197 0.1110 0.1201 0.1193 0.1326
va: 5.7268 1.0843 1.1200 1.1256 1.9907 1.9893 2.0936 2.1308 2.1326 2.9914 2.9644 2.9684 2.9256 3.8306 3.5764 3.9785 3.8698 4.1418 3.9317 3.9824 3.9352 3.9106 4.0416 4.2397 4.1658 3.8414 3.8463 0.9908 1.0013 1.0038 0.9788 1.0104 0.9966 0.9865 0.9942 0.9947 1.0029 0.9951 0.9942 0.9942
dispcorr: -0.026152049 hartree
energy: -1834.354508958510
dipole: -17.77327 17.90075 0.12748 -8.10268 9.43948 1.33680 3.85339 -2.06675 1.78664
magnitude: 2.23503 au
magnitude: 5.68100 debye
