program: Orca
programVersion: 5.0.2
elementType: S F F F O O O O O N N N N C C C C C C C C C C C C C C H H H H H H H H H H H H H
charge: 0
multiplicity: 1
keywords: wb97x-d3
keywords: def2-TZVPP
keywords: def2/J RIJCOSX
keywords: DEFGRID2
keywords: scfconv7
keywords: smallprint printgap noloewdin
keywords: NOSOSCF
formula: C14H13F3N4O5S
InChI: InChI=1/C14H13F3N4O5S/c1-21(27(23,24)12(16)17)9-7(5-4-6-8(9)15)10(22)11-18-13(25-2)20-14(19-11)26-3/h4-6,12H,1-3H3
40 atoms
S  0.611304 1.333658 -0.935415
F  2.856172 1.366808 2.035191
F  1.765341 3.288121 -2.119726
F  1.307951 3.645274 -0.017302
O  -0.706333 1.901892 -1.138275
O  1.182154 0.381734 -1.868276
O  0.650626 -2.969712 -1.244263
O  -3.506459 -0.294097 -2.077423
O  -3.065744 -1.041432 2.3335
N  0.658656 0.664978 0.564619
N  -1.354006 -1.532731 1.005577
N  -1.556725 -1.206216 -1.31964
N  -3.341029 -0.635831 0.1078
C  1.671543 -0.279056 0.866987
C  1.59651 -1.606016 0.430198
C  2.762426 0.095021 1.639081
C  -0.097734 1.282951 1.662004
C  1.784117 2.747657 -0.892116
C  2.611944 -2.500157 0.755304
C  0.488658 -2.095898 -0.426703
C  3.753715 -0.792601 2.001665
C  3.67079 -2.100314 1.553241
C  -0.900812 -1.548956 -0.225449
C  -2.768715 -0.727555 -1.085674
C  -2.600901 -1.063673 1.108657
C  -2.970247 -0.318716 -3.402796
C  -4.375176 -0.520966 2.569711
H  0.371868 2.185608 2.046453
H  -0.166574 0.555574 2.465276
H  -1.107345 1.517299 1.3365
H  2.791827 2.428553 -0.624364
H  2.558047 -3.523374 0.410309
H  4.581553 -0.45732 2.612511
H  4.442717 -2.807436 1.822349
H  -3.74105 0.110368 -4.035988
H  -2.761433 -1.336574 -3.72825
H  -2.065277 0.282669 -3.475526
H  -5.135395 -1.104971 2.053197
H  -4.446947 0.522707 2.266726
H  -4.52915 -0.596392 3.642015
elementType: S F O N C H
totalener: -1834.32809038 hartree
nucrepener: 3053.04118180 hartree
electener: -4887.36927218 hartree
oneelecener: -8595.53143199 hartree
twoeener: 3708.16215981 hartree
cpcmener: -0.04885584 hartree
kineticenergy: 1828.03479893 hartree
xcener: -146.962293998411 hartree
chargesum: -0.0000000
charge: 0.845867 -0.208768 -0.175229 -0.174161 -0.509497 -0.498439 -0.380588 -0.279590 -0.282448 -0.101750 -0.358817 -0.362823 -0.378273 0.012418 -0.017219 0.251091 -0.213869 0.273679 -0.106661 0.254319 -0.141246 -0.137356 0.217708 0.447464 0.485869 -0.112564 -0.117381 0.141399 0.134623 0.133520 0.149837 0.146125 0.157077 0.168463 0.133550 0.120033 0.111816 0.120128 0.119202 0.132494
qa: 0.8459 -0.2088 -0.1752 -0.1742 -0.5095 -0.4984 -0.3806 -0.2796 -0.2824 -0.1018 -0.3588 -0.3628 -0.3783 0.0124 -0.0172 0.2511 -0.2139 0.2737 -0.1067 0.2543 -0.1412 -0.1374 0.2177 0.4475 0.4859 -0.1126 -0.1174 0.1414 0.1346 0.1335 0.1498 0.1461 0.1571 0.1685 0.1335 0.1200 0.1118 0.1201 0.1192 0.1325
va: 5.7085 1.0837 1.1187 1.1187 1.9936 1.9883 2.0943 2.1298 2.1292 2.9871 2.9588 2.9599 2.9260 3.8185 3.5915 3.9787 3.8712 4.1596 3.9313 3.9728 3.9494 3.9058 4.0612 4.2487 4.1630 3.8416 3.8454 1.0030 0.9937 1.0018 0.9816 1.0117 0.9961 0.9865 0.9942 0.9947 1.0025 0.9951 0.9945 0.9941
dispcorr: -0.026025669 hartree
energy: -1834.354116050148
dipole: -14.56565 15.63871 1.07306 -10.20185 10.75043 0.54858 6.55820 -3.83139 2.72681
magnitude: 2.98126 au
magnitude: 7.57776 debye
