program: Orca
programVersion: 5.0.2
elementType: S F F F O O O O O N N N N C C C C C C C C C C C C C C H H H H H H H H H H H H H
charge: 0
multiplicity: 1
keywords: wb97x-d3
keywords: def2-TZVPP
keywords: def2/J RIJCOSX
keywords: DEFGRID2
keywords: scfconv7
keywords: smallprint printgap noloewdin
keywords: NOSOSCF
formula: C14H13F3N4O5S
InChI: InChI=1/C14H13F3N4O5S/c1-21(27(23,24)12(16)17)9-7(5-4-6-8(9)15)10(22)11-18-13(25-2)20-14(19-11)26-3/h4-6,12H,1-3H3
40 atoms
S  0.203862 1.520838 0.965251
F  3.255174 1.270659 -1.176411
F  0.864841 3.75558 2.039543
F  2.541884 2.518351 1.396803
O  0.452388 0.729775 2.154559
O  -1.108275 2.05742 0.665083
O  0.125421 -2.625654 1.882192
O  -4.077109 -0.189251 0.603209
O  -2.001883 -1.646467 -3.108737
N  0.717624 0.65972 -0.337974
N  -0.90878 -1.758322 -1.177327
N  -1.978683 -1.061973 0.805041
N  -3.099453 -0.890681 -1.259903
C  1.789559 -0.251912 -0.175783
C  1.595529 -1.50275 0.416416
C  3.064625 0.075925 -0.612644
C  0.353468 1.143912 -1.67692
C  1.327891 2.973002 1.053197
C  2.672942 -2.364932 0.59271
C  0.263259 -1.924244 0.909419
C  4.134152 -0.784722 -0.479696
C  3.93072 -2.011373 0.133377
C  -0.955891 -1.533254 0.114838
C  -3.017461 -0.728332 0.05442
C  -2.03146 -1.419771 -1.81855
C  -4.083608 0.050994 2.01313
C  -3.132812 -1.284663 -3.904475
H  -0.72725 1.189791 -1.779514
H  0.730748 0.430521 -2.403377
H  0.77444 2.123798 -1.900363
H  1.36257 3.517908 0.107649
H  2.521702 -3.326863 1.063735
H  5.112256 -0.489397 -0.836119
H  4.761371 -2.692876 0.253308
H  -3.990958 -0.877418 2.575129
H  -5.046925 0.505782 2.225977
H  -3.287512 0.736242 2.301712
H  -2.867175 -1.548724 -4.923819
H  -3.330668 -0.214913 -3.848679
H  -4.022704 -1.837852 -3.607351
elementType: S F O N C H
totalener: -1834.32850342 hartree
nucrepener: 3057.50208122 hartree
electener: -4891.83058464 hartree
oneelecener: -8604.65076383 hartree
twoeener: 3712.82017919 hartree
cpcmener: -0.05231968 hartree
kineticenergy: 1828.03278565 hartree
xcener: -146.961182193047 hartree
chargesum: -0.0000000
charge: 0.847965 -0.207931 -0.175151 -0.170370 -0.496383 -0.508471 -0.379853 -0.278877 -0.282071 -0.089132 -0.357389 -0.369327 -0.381094 0.017663 -0.030626 0.234054 -0.208873 0.270074 -0.110926 0.236668 -0.132096 -0.139481 0.236987 0.452627 0.478536 -0.111365 -0.118737 0.125098 0.137113 0.152154 0.149658 0.148317 0.155819 0.168451 0.119677 0.133407 0.111325 0.132524 0.119648 0.120391
qa: 0.8480 -0.2079 -0.1752 -0.1704 -0.4964 -0.5085 -0.3799 -0.2789 -0.2821 -0.0891 -0.3574 -0.3693 -0.3811 0.0177 -0.0306 0.2341 -0.2089 0.2701 -0.1109 0.2367 -0.1321 -0.1395 0.2370 0.4526 0.4785 -0.1114 -0.1187 0.1251 0.1371 0.1522 0.1497 0.1483 0.1558 0.1685 0.1197 0.1334 0.1113 0.1325 0.1196 0.1204
va: 5.7044 1.0840 1.1190 1.1182 1.9984 1.9869 2.0938 2.1312 2.1312 2.9787 2.9687 2.9656 2.9204 3.8445 3.5853 3.9599 3.8762 4.1590 3.9316 3.9894 3.9384 3.9079 4.0344 4.2430 4.1720 3.8405 3.8460 1.0019 0.9915 0.9915 0.9814 1.0100 0.9965 0.9864 0.9950 0.9942 1.0031 0.9943 0.9941 0.9948
dispcorr: -0.025974518 hartree
energy: -1834.354477941017
dipole: -14.20440 15.36547 1.16107 -9.52798 10.39426 0.86628 -12.90526 9.76297 -3.14230
magnitude: 3.46014 au
magnitude: 8.79497 debye
