program: Orca
programVersion: 5.0.2
elementType: S F F F O O O O O N N N N C C C C C C C C C C C C C C H H H H H H H H H H H H H
charge: 0
multiplicity: 1
keywords: wb97x-d3
keywords: def2-TZVPP
keywords: def2/J RIJCOSX
keywords: DEFGRID2
keywords: scfconv7
keywords: smallprint printgap noloewdin
keywords: NOSOSCF
formula: C14H13F3N4O5S
InChI: InChI=1/C14H13F3N4O5S/c1-21(27(23,24)12(16)17)9-7(5-4-6-8(9)15)10(22)11-18-13(25-2)20-14(19-11)26-3/h4-6,12H,1-3H3
40 atoms
S  0.60514 1.395682 -1.012516
F  2.589184 1.538129 2.195772
F  3.009007 2.302981 -0.716622
F  1.764904 3.376636 -2.150201
O  -0.684465 1.992199 -1.289404
O  1.195323 0.403247 -1.886156
O  0.752191 -2.817624 -1.279909
O  -3.591612 -0.438923 -2.072671
O  -3.082756 -1.191258 2.326832
N  0.56562 0.775804 0.51171
N  -1.33681 -1.525774 0.991492
N  -1.573558 -1.19548 -1.329127
N  -3.396184 -0.79838 0.107526
C  1.57771 -0.132317 0.906933
C  1.584226 -1.455248 0.458739
C  2.591595 0.275823 1.761573
C  -0.270794 1.435077 1.522283
C  1.78499 2.801954 -0.937867
C  2.615407 -2.310277 0.832852
C  0.530106 -1.974737 -0.447927
C  3.598602 -0.572196 2.170852
C  3.60859 -1.872722 1.692851
C  -0.891121 -1.509652 -0.243082
C  -2.821578 -0.823612 -1.087769
C  -2.618907 -1.168898 1.102391
C  -3.049728 -0.404474 -3.394804
C  -4.433948 -0.7903 2.555196
H  -0.281292 0.80496 2.406947
H  -1.292483 1.524317 1.163478
H  0.096145 2.422754 1.7991
H  1.506998 3.519307 -0.1636
H  2.626586 -3.329365 0.470885
H  4.369096 -0.21213 2.840381
H  4.396723 -2.547359 1.997581
H  -3.84897 -0.028004 -4.027243
H  -2.759273 -1.398789 -3.732509
H  -2.19246 0.265649 -3.455518
H  -4.602667 0.238922 2.23943
H  -4.584075 -0.867909 3.628369
H  -5.137543 -1.445926 2.04274
elementType: S F O N C H
totalener: -1834.32862485 hartree
nucrepener: 3054.20269727 hartree
electener: -4888.53132212 hartree
oneelecener: -8597.89860010 hartree
twoeener: 3709.36727799 hartree
cpcmener: -0.04308560 hartree
kineticenergy: 1828.05692402 hartree
xcener: -146.964162401252 hartree
chargesum: -0.0000000
charge: 0.838619 -0.208981 -0.170087 -0.173915 -0.498684 -0.481207 -0.355348 -0.271336 -0.275284 -0.088888 -0.353373 -0.359730 -0.378861 0.013834 -0.017033 0.230752 -0.213545 0.269564 -0.111046 0.219745 -0.131764 -0.139506 0.222208 0.447528 0.471362 -0.112252 -0.118199 0.136028 0.127201 0.147655 0.143532 0.145009 0.152614 0.164595 0.130877 0.118766 0.112194 0.117112 0.130642 0.119202
qa: 0.8386 -0.2090 -0.1701 -0.1739 -0.4987 -0.4812 -0.3553 -0.2713 -0.2753 -0.0889 -0.3534 -0.3597 -0.3789 0.0138 -0.0170 0.2308 -0.2135 0.2696 -0.1110 0.2197 -0.1318 -0.1395 0.2222 0.4475 0.4714 -0.1123 -0.1182 0.1360 0.1272 0.1477 0.1435 0.1450 0.1526 0.1646 0.1309 0.1188 0.1122 0.1171 0.1306 0.1192
va: 5.7216 1.0816 1.1192 1.1202 1.9982 2.0159 2.1239 2.1410 2.1373 2.9797 2.9667 2.9674 2.9244 3.8369 3.5763 3.9640 3.8769 4.1633 3.9359 4.0054 3.9359 3.9109 4.0366 4.2493 4.1797 3.8457 3.8498 0.9922 1.0022 0.9932 0.9830 1.0117 0.9976 0.9879 0.9942 0.9953 1.0022 0.9951 0.9942 0.9955
dispcorr: -0.025755097 hartree
energy: -1834.354379946061
dipole: -18.54256 18.44762 -0.09494 -7.93510 9.15732 1.22222 7.78497 -4.87614 2.90883
magnitude: 3.15660 au
magnitude: 8.02345 debye
