program: Orca
programVersion: 4.2.1
elementType: S S O O O O O O O N N N N C C C C C C C C C C C C H H H H H H H H H H H H H H
charge: 0
multiplicity: 1
keywords: wb97x-d3
keywords: def2-TZVPP
keywords: def2/J RIJCOSX GRIDX6 NOFINALGRIDX
keywords: grid4 nofinalgrid
keywords: scfconv7
keywords: smallprint printgap noloewdin
keywords: NOSOSCF
formula: C12H14N4O7S2
InChI: InChI=1/C12H14N4O7S2/c1-6-8(7(5-24-6)9(17)22-3)25(20,21)14-10(18)16-12(19)15(2)11(13-16)23-4/h5,14H,1-4H3
39 atoms
S  1.44427 0.034391 1.861647
S  3.585072 -1.614642 -1.391812
O  1.85417 1.374169 2.230811
O  1.61539 -1.044852 2.808222
O  -5.039561 -1.153518 -1.098114
O  2.546955 2.69539 -1.555842
O  -0.458974 -1.94859 0.776495
O  -2.292732 1.822947 0.993944
O  0.714833 2.166142 -0.39289
N  -0.187703 0.181752 1.523881
N  -2.138464 -0.453388 0.471107
N  -3.9308 0.593627 -0.10415
N  -2.931241 -1.389348 -0.153569
C  2.205965 -0.400532 0.34375
C  2.797038 -1.619494 0.130906
C  2.405629 0.535625 -0.727313
C  3.14781 -0.00484 -1.729233
C  -0.880774 -0.829207 0.920927
C  2.887535 -2.853947 0.960312
C  -2.734325 0.794811 0.515132
C  -3.97868 -0.719922 -0.475541
C  1.792528 1.875656 -0.849557
C  -4.949505 1.597166 -0.328015
C  -5.041822 -2.53407 -1.48226
C  2.014498 3.994838 -1.83552
H  -0.557925 1.133118 1.488001
H  3.429293 0.45351 -2.664565
H  1.906993 -3.179998 1.293552
H  3.330332 -3.665563 0.387335
H  3.511824 -2.693295 1.837437
H  -5.881607 1.306119 0.149021
H  -5.111494 1.746162 -1.392453
H  -4.613329 2.532555 0.107915
H  -5.987114 -2.698657 -1.988627
H  -4.976913 -3.180581 -0.608226
H  -4.219336 -2.748534 -2.163338
H  1.105884 3.9290 -2.432355
H  2.781506 4.514077 -2.40164
H  1.810706 4.544156 -0.917451
elementType: S O N C H
totalener: -2007.85278828 hartree
nucrepener: 2771.66707477 hartree
electener: -4779.51986305 hartree
oneelecener: -8272.35555723 hartree
twoeener: 3492.83569418 hartree
cpcmener: -0.05607638 hartree
kineticenergy: 2001.55463533 hartree
xcener: -148.482089492976 hartree
chargesum: -0.0000000
charge: 0.882421 0.117942 -0.513985 -0.503617 -0.302766 -0.280527 -0.443222 -0.506788 -0.460307 -0.201739 0.049666 -0.118068 -0.378800 -0.282349 0.127431 0.025475 -0.170895 0.356771 -0.195439 0.411824 0.439771 0.506174 -0.159419 -0.113168 -0.121683 0.218965 0.164877 0.111843 0.092567 0.117546 0.131759 0.132927 0.113162 0.135036 0.121894 0.121847 0.122579 0.132097 0.118199
qa: 0.8824 0.1179 -0.5140 -0.5036 -0.3028 -0.2805 -0.4432 -0.5068 -0.4603 -0.2017 0.0497 -0.1181 -0.3788 -0.2823 0.1274 0.0255 -0.1709 0.3568 -0.1954 0.4118 0.4398 0.5062 -0.1594 -0.1132 -0.1217 0.2190 0.1649 0.1118 0.0926 0.1175 0.1318 0.1329 0.1132 0.1350 0.1219 0.1218 0.1226 0.1321 0.1182
va: 5.8278 2.8100 1.9766 1.9950 2.1348 2.1410 2.0767 2.0054 2.0302 3.1390 3.1727 3.3267 2.8086 3.7759 3.7828 3.6439 4.1049 4.4177 3.8920 4.2579 4.1220 4.0348 3.8573 3.8331 3.8509 1.0474 1.0060 1.0099 1.0059 0.9981 0.9910 0.9902 1.0134 0.9912 0.9942 0.9944 0.9931 0.9943 0.9939
dispcorr: -0.020957918 hartree
energy: -2007.873746197559
dipole: -12.78230 10.65713 -2.12517 2.06778 -2.01554 0.05224 -9.87864 5.82381 -4.05483
magnitude: 4.57829 au
magnitude: 11.63708 debye
