program: Orca
programVersion: 4.2.1
elementType: S S O O O O O O O N N N N C C C C C C C C C C C C H H H H H H H H H H H H H H
charge: 0
multiplicity: 1
keywords: wb97x-d3
keywords: def2-TZVPP
keywords: def2/J RIJCOSX GRIDX6 NOFINALGRIDX
keywords: grid4 nofinalgrid
keywords: scfconv7
keywords: smallprint printgap noloewdin
keywords: NOSOSCF
formula: C12H14N4O7S2
InChI: InChI=1/C12H14N4O7S2/c1-6-8(7(5-24-6)9(17)22-3)25(20,21)14-10(18)16-12(19)15(2)11(13-16)23-4/h5,14H,1-4H3
39 atoms
S  1.429913 0.023017 1.86068
S  3.601736 -1.60278 -1.387038
O  1.8427 1.354576 2.253401
O  1.579226 -1.06854 2.796236
O  -5.074269 -1.173558 -1.065217
O  2.591288 2.701614 -1.551836
O  -0.474077 -1.954163 0.769822
O  -2.296545 1.824096 0.953723
O  0.775481 2.21386 -0.344808
N  -0.195563 0.183218 1.496553
N  -2.152221 -0.458935 0.457549
N  -3.951057 0.582898 -0.105734
N  -2.953366 -1.401129 -0.14632
C  2.212286 -0.397201 0.347133
C  2.796185 -1.617807 0.128354
C  2.430106 0.549571 -0.711348
C  3.179227 0.013639 -1.711401
C  -0.89273 -0.832228 0.904935
C  2.868108 -2.861984 0.945138
C  -2.745935 0.790295 0.494648
C  -4.00463 -0.734502 -0.461771
C  1.836523 1.898652 -0.824758
C  -4.972417 1.584428 -0.326174
C  -5.085379 -2.557413 -1.435286
C  2.077684 4.007174 -1.832541
H  -0.557113 1.137129 1.446999
H  3.475793 0.479672 -2.638315
H  3.321901 -3.668333 0.371538
H  3.475371 -2.712624 1.83634
H  1.879443 -3.190623 1.254661
H  -5.898363 1.297832 0.165447
H  -5.148086 1.723642 -1.389754
H  -4.630776 2.523698 0.096902
H  -6.039152 -2.725122 -1.924452
H  -5.007465 -3.195835 -0.556219
H  -4.274781 -2.780751 -2.127829
H  2.83777 4.501471 -2.429576
H  1.913145 4.573783 -0.916783
H  1.149588 3.953051 -2.400795
elementType: S O N C H
totalener: -2007.85290184 hartree
nucrepener: 2767.69368061 hartree
electener: -4775.54658245 hartree
oneelecener: -8264.39744515 hartree
twoeener: 3488.85086270 hartree
cpcmener: -0.05628211 hartree
kineticenergy: 2001.54178580 hartree
xcener: -148.479956280571 hartree
chargesum: -0.0000000
charge: 0.883030 0.117822 -0.513163 -0.503091 -0.302677 -0.280951 -0.443666 -0.507307 -0.462200 -0.203510 0.049942 -0.118322 -0.379169 -0.286429 0.127515 0.025264 -0.170030 0.358791 -0.195928 0.411812 0.439926 0.510994 -0.159347 -0.113305 -0.121451 0.220178 0.164439 0.092487 0.117094 0.112777 0.131669 0.132929 0.113033 0.135025 0.121805 0.121859 0.131891 0.118274 0.121991
qa: 0.8830 0.1178 -0.5132 -0.5031 -0.3027 -0.2810 -0.4437 -0.5073 -0.4622 -0.2035 0.0499 -0.1183 -0.3792 -0.2864 0.1275 0.0253 -0.1700 0.3588 -0.1959 0.4118 0.4399 0.5110 -0.1593 -0.1133 -0.1215 0.2202 0.1644 0.0925 0.1171 0.1128 0.1317 0.1329 0.1130 0.1350 0.1218 0.1219 0.1319 0.1183 0.1220
va: 5.8277 2.8088 1.9776 1.9961 2.1348 2.1391 2.0759 2.0047 2.0271 3.1387 3.1725 3.3264 2.8083 3.7850 3.7826 3.6419 4.1050 4.4157 3.8918 4.2584 4.1220 4.0276 3.8575 3.8333 3.8515 1.0465 1.0067 1.0058 0.9983 1.0093 0.9910 0.9901 1.0135 0.9912 0.9941 0.9943 0.9943 0.9936 0.9932
dispcorr: -0.020858482 hartree
energy: -2007.873760325742
dipole: -12.79884 10.68130 -2.11754 2.01642 -1.98095 0.03546 -9.83722 5.78019 -4.05703
magnitude: 4.57654 au
magnitude: 11.63264 debye
