program: Orca
programVersion: 4.2.1
elementType: S S O O O O O O O N N N N C C C C C C C C C C C C H H H H H H H H H H H H H H
charge: 0
multiplicity: 1
keywords: wb97x-d3
keywords: def2-TZVPP
keywords: def2/J RIJCOSX GRIDX6 NOFINALGRIDX
keywords: grid4 nofinalgrid
keywords: scfconv7
keywords: smallprint printgap noloewdin
keywords: NOSOSCF
formula: C12H14N4O7S2
InChI: InChI=1/C12H14N4O7S2/c1-6-8(7(5-24-6)9(17)22-3)25(20,21)14-10(18)16-12(19)15(2)11(13-16)23-4/h5,14H,1-4H3
39 atoms
S  1.414166 -0.077365 -1.750653
S  3.660208 -1.540241 1.521469
O  1.521534 -1.2190 -2.630798
O  1.830581 1.22654 -2.223989
O  -5.26149 -1.215552 0.830277
O  2.854351 2.816759 1.298738
O  -0.52312 -2.000239 -0.604831
O  -2.320566 1.778094 -0.95126
O  0.905057 2.279602 0.34524
N  -0.195694 0.125597 -1.345714
N  -2.215791 -0.499844 -0.426426
N  -4.061083 0.539206 -0.034801
N  -3.063783 -1.439953 0.113601
C  2.23947 -0.421374 -0.243702
C  2.790796 -1.64258 0.046166
C  2.538105 0.596139 0.724435
C  3.311872 0.113096 1.731782
C  -0.929851 -0.880167 -0.784778
C  2.791746 -2.943667 -0.679785
C  -2.807898 0.746217 -0.52718
C  -4.14223 -0.775805 0.325314
C  1.9995 1.973861 0.750761
C  -5.104206 1.536077 0.079971
C  -5.30414 -2.599926 1.197022
C  2.422596 4.170476 1.470902
H  -0.554172 1.081555 -1.345553
H  3.669386 0.640487 2.602785
H  3.224844 -3.726202 -0.059311
H  1.784262 -3.25049 -0.946648
H  3.384716 -2.882609 -1.591012
H  -5.964361 1.259669 -0.524325
H  -4.716338 2.483969 -0.279261
H  -5.405978 1.654201 1.117363
H  -4.567498 -2.819948 1.968609
H  -5.133479 -3.237006 0.330202
H  -6.302228 -2.772673 1.585664
H  2.161134 4.626944 0.517043
H  3.268185 4.697076 1.902834
H  1.573165 4.228599 2.150832
elementType: S O N C H
totalener: -2007.85311073 hartree
nucrepener: 2752.83023761 hartree
electener: -4760.68334834 hartree
oneelecener: -8234.71895343 hartree
twoeener: 3474.03560509 hartree
cpcmener: -0.05634934 hartree
kineticenergy: 2001.53721030 hartree
xcener: -148.479318581974 hartree
chargesum: -0.0000000
charge: 0.878836 0.116713 -0.502317 -0.512276 -0.302829 -0.279220 -0.447522 -0.510453 -0.460765 -0.200673 0.049948 -0.118694 -0.379681 -0.281720 0.128912 0.024417 -0.172501 0.365869 -0.200310 0.412771 0.440877 0.503274 -0.159551 -0.114043 -0.120676 0.220053 0.165797 0.093404 0.114618 0.118114 0.132821 0.113286 0.131679 0.121887 0.121269 0.136000 0.117782 0.131753 0.123149
qa: 0.8788 0.1167 -0.5023 -0.5123 -0.3028 -0.2792 -0.4475 -0.5105 -0.4608 -0.2007 0.0499 -0.1187 -0.3797 -0.2817 0.1289 0.0244 -0.1725 0.3659 -0.2003 0.4128 0.4409 0.5033 -0.1596 -0.1140 -0.1207 0.2201 0.1658 0.0934 0.1146 0.1181 0.1328 0.1133 0.1317 0.1219 0.1213 0.1360 0.1178 0.1318 0.1231
va: 5.8319 2.8078 1.9978 1.9780 2.1346 2.1388 2.0715 2.0008 2.0296 3.1422 3.1744 3.3265 2.8077 3.7792 3.7824 3.6439 4.1037 4.4108 3.8919 4.2577 4.1199 4.0361 3.8577 3.8332 3.8500 1.0445 1.0054 1.0059 1.0093 0.9976 0.9903 1.0132 0.9909 0.9942 0.9944 0.9910 0.9940 0.9942 0.9928
dispcorr: -0.020602906 hartree
energy: -2007.873713636470
dipole: -12.85802 10.75934 -2.09868 2.31336 -2.11707 0.19629 8.17462 -4.51856 3.65606
magnitude: 4.22016 au
magnitude: 10.72681 debye
