program: Orca
programVersion: 4.2.1
elementType: S S O O O O O O O N N N N C C C C C C C C C C C C H H H H H H H H H H H H H H
charge: 0
multiplicity: 1
keywords: wb97x-d3
keywords: def2-TZVPP
keywords: def2/J RIJCOSX GRIDX6 NOFINALGRIDX
keywords: grid4 nofinalgrid
keywords: scfconv7
keywords: smallprint printgap noloewdin
keywords: NOSOSCF
formula: C12H14N4O7S2
InChI: InChI=1/C12H14N4O7S2/c1-6-8(7(5-24-6)9(17)22-3)25(20,21)14-10(18)16-12(19)15(2)11(13-16)23-4/h5,14H,1-4H3
39 atoms
S  1.479554 0.046225 1.895476
S  3.576098 -1.576716 -1.400685
O  1.87802 1.39318 2.250984
O  1.696018 -1.027512 2.838734
O  -4.930919 -1.086593 -1.204113
O  2.357966 2.673199 -1.65124
O  -0.405093 -1.940342 0.784999
O  -2.28203 1.801052 1.122493
O  0.626414 2.13354 -0.348372
N  -0.164195 0.166691 1.605886
N  -2.092725 -0.448163 0.500481
N  -3.869035 0.616221 -0.091998
N  -2.857315 -1.358669 -0.19333
C  2.208598 -0.380478 0.357241
C  2.830727 -1.583347 0.144286
C  2.347504 0.545624 -0.732482
C  3.081653 0.0144 -1.745998
C  -0.840396 -0.83014 0.959911
C  2.972911 -2.807583 0.981455
C  -2.69729 0.794455 0.578837
C  -3.895711 -0.679144 -0.523747
C  1.680795 1.85795 -0.86483
C  -4.882404 1.626147 -0.311264
C  -4.913714 -2.445812 -1.656638
C  1.753691 3.932849 -1.961805
H  -0.548355 1.113305 1.598803
H  3.322253 0.466459 -2.695608
H  3.431262 -3.609629 0.407035
H  3.605456 -2.622979 1.847077
H  2.007382 -3.161199 1.331759
H  -5.002016 1.82257 -1.373573
H  -4.567972 2.541732 0.179447
H  -5.831616 1.311641 0.114282
H  -4.064402 -2.625653 -2.314437
H  -5.837698 -2.585293 -2.20789
H  -4.882329 -3.135657 -0.814293
H  0.813716 3.798375 -2.494907
H  2.460399 4.449195 -2.60255
H  1.582773 4.523153 -1.06348
elementType: S O N C H
totalener: -2007.85241500 hartree
nucrepener: 2780.13786692 hartree
electener: -4787.99028192 hartree
oneelecener: -8289.26195069 hartree
twoeener: 3501.27166877 hartree
cpcmener: -0.05605388 hartree
kineticenergy: 2001.55625865 hartree
xcener: -148.482296083645 hartree
chargesum: -0.0000000
charge: 0.883895 0.118397 -0.514597 -0.504273 -0.302550 -0.282054 -0.440589 -0.505825 -0.460944 -0.200648 0.049618 -0.117819 -0.377509 -0.284897 0.125121 0.027059 -0.169572 0.351536 -0.193283 0.411640 0.439305 0.510471 -0.159537 -0.113313 -0.121969 0.217723 0.164410 0.092075 0.117128 0.111468 0.133186 0.113541 0.131331 0.121706 0.135069 0.122035 0.122484 0.132531 0.117651
qa: 0.8839 0.1184 -0.5146 -0.5043 -0.3026 -0.2821 -0.4406 -0.5058 -0.4609 -0.2006 0.0496 -0.1178 -0.3775 -0.2849 0.1251 0.0271 -0.1696 0.3515 -0.1933 0.4116 0.4393 0.5105 -0.1595 -0.1133 -0.1220 0.2177 0.1644 0.0921 0.1171 0.1115 0.1332 0.1135 0.1313 0.1217 0.1351 0.1220 0.1225 0.1325 0.1177
va: 5.8259 2.8101 1.9760 1.9936 2.1349 2.1397 2.0795 2.0064 2.0308 3.1369 3.1731 3.3261 2.8100 3.7786 3.7834 3.6424 4.1050 4.4207 3.8921 4.2573 4.1235 4.0353 3.8572 3.8332 3.8517 1.0491 1.0068 1.0058 0.9986 1.0094 0.9902 1.0133 0.9913 0.9944 0.9911 0.9939 0.9931 0.9942 0.9939
dispcorr: -0.021119413 hartree
energy: -2007.873534409326
dipole: -12.93590 10.74675 -2.18914 2.15465 -2.08116 0.07349 -10.58092 6.35211 -4.22881
magnitude: 4.76242 au
magnitude: 12.10510 debye
