program: Orca
programVersion: 4.2.1
elementType: S S O O O O O O O N N N N C C C C C C C C C C C C H H H H H H H H H H H H H H
charge: 0
multiplicity: 1
keywords: wb97x-d3
keywords: def2-TZVPP
keywords: def2/J RIJCOSX GRIDX6 NOFINALGRIDX
keywords: grid4 nofinalgrid
keywords: scfconv7
keywords: smallprint printgap noloewdin
keywords: NOSOSCF
formula: C12H14N4O7S2
InChI: InChI=1/C12H14N4O7S2/c1-6-8(7(5-24-6)9(17)22-3)25(20,21)14-10(18)16-12(19)15(2)11(13-16)23-4/h5,14H,1-4H3
39 atoms
S  1.403788 -0.040654 -1.743447
S  3.712283 -1.56606 1.469344
O  1.484067 -1.189637 -2.608451
O  1.81868 1.26388 -2.197459
O  -5.286083 -1.243868 0.839315
O  2.92549 2.799986 1.364583
O  -0.510554 -1.943378 -0.480937
O  -2.424855 1.774605 -1.047722
O  0.96852 2.297684 0.410744
N  -0.198485 0.166619 -1.28291
N  -2.237881 -0.470043 -0.395353
N  -4.133377 0.519778 -0.098444
N  -3.06819 -1.404691 0.175617
C  2.2535 -0.406151 -0.24317
C  2.79076 -1.636843 0.022296
C  2.596148 0.593897 0.725291
C  3.396012 0.091037 1.703084
C  -0.921137 -0.842634 -0.711192
C  2.7182 -2.935672 -0.707723
C  -2.864362 0.749213 -0.581545
C  -4.171108 -0.776099 0.329757
C  2.060926 1.97344 0.785505
C  -5.195648 1.49346 -0.061972
C  -5.252166 -2.607261 1.253237
C  2.501171 4.147594 1.528137
H  -0.554944 1.121165 -1.301035
H  3.790515 0.616266 2.55785
H  3.185433 -3.727227 -0.123329
H  1.683667 -3.21107 -0.895944
H  3.228679 -2.876856 -1.66694
H  -6.047067 1.16169 -0.653052
H  -4.814375 2.420073 -0.481726
H  -5.520228 1.67615 0.960681
H  -4.505666 -2.762495 2.032394
H  -5.025656 -3.266143 0.414789
H  -6.242629 -2.826695 1.640012
H  2.27288 4.611015 0.568288
H  3.334021 4.667239 1.994245
H  1.621465 4.218086 2.169008
totalener: -2007.82683523 hartree
nucrepener: 2747.36541535 hartree
electener: -4755.19225058 hartree
oneelecener: -8222.44314906 hartree
twoeener: 3467.25089849 hartree
kineticenergy: 2001.59615493 hartree
xcener: -148.474604722318 hartree
chargesum: -0.0000000
charge: 0.849798 0.094510 -0.441216 -0.445066 -0.295777 -0.271251 -0.358761 -0.414565 -0.373144 -0.212726 0.014458 -0.159750 -0.303011 -0.290736 0.132340 0.034368 -0.178470 0.332174 -0.210950 0.353121 0.394780 0.444004 -0.170318 -0.123291 -0.128828 0.214904 0.131640 0.073060 0.133687 0.112860 0.116517 0.124343 0.115550 0.118696 0.119794 0.122213 0.118731 0.117151 0.109163
qa: 0.8498 0.0945 -0.4412 -0.4451 -0.2958 -0.2713 -0.3588 -0.4146 -0.3731 -0.2127 0.0145 -0.1598 -0.3030 -0.2907 0.1323 0.0344 -0.1785 0.3322 -0.2110 0.3531 0.3948 0.4440 -0.1703 -0.1233 -0.1288 0.2149 0.1316 0.0731 0.1337 0.1129 0.1165 0.1243 0.1155 0.1187 0.1198 0.1222 0.1187 0.1172 0.1092
va: 5.8731 2.7912 2.0686 2.0557 2.1195 2.1237 2.1614 2.0968 2.1148 3.1560 3.1764 3.2750 2.8346 3.8580 3.7898 3.6605 4.1054 4.4066 3.9131 4.2893 4.1071 4.0844 3.8718 3.8622 3.8880 1.0421 1.0184 1.0050 1.0067 1.0016 0.9925 1.0148 0.9925 0.9965 0.9969 0.9898 0.9946 0.9936 0.9956
dispcorr: -0.020515387 hartree
energy: -2007.847350620185
dipole: -12.89785 11.28915 -1.60870 2.07640 -1.98169 0.09471 7.89392 -5.55429 2.33962
magnitude: 2.84090 au
magnitude: 7.22099 debye
