program: Orca
programVersion: 4.2.1
elementType: S S O O O O O O O N N N N C C C C C C C C C C C C H H H H H H H H H H H H H H
charge: 0
multiplicity: 1
keywords: wb97x-d3
keywords: def2-TZVPP
keywords: def2/J RIJCOSX GRIDX6 NOFINALGRIDX
keywords: grid4 nofinalgrid
keywords: scfconv7
keywords: smallprint printgap noloewdin
keywords: NOSOSCF
formula: C12H14N4O7S2
InChI: InChI=1/C12H14N4O7S2/c1-6-8(7(5-24-6)9(17)22-3)25(20,21)14-10(18)16-12(19)15(2)11(13-16)23-4/h5,14H,1-4H3
39 atoms
S  1.371066 0.054931 1.785402
S  3.730718 -1.635228 -1.305912
O  1.776101 1.383629 2.173443
O  1.441764 -1.045129 2.712499
O  -5.244435 -1.282071 -0.919262
O  2.918046 2.723928 -1.462286
O  -0.51625 -1.917405 0.591545
O  -2.438958 1.825973 0.905064
O  0.953419 2.266153 -0.502185
N  -0.224679 0.231796 1.290925
N  -2.238323 -0.450556 0.379417
N  -4.118127 0.526379 -0.036206
N  -3.052054 -1.41241 -0.169778
C  2.243327 -0.389094 0.319302
C  2.790455 -1.629575 0.130844
C  2.593372 0.556587 -0.699875
C  3.40864 0.003955 -1.63729
C  -0.931885 -0.806271 0.752326
C  2.714689 -2.885782 0.931787
C  -2.865896 0.778297 0.478444
C  -4.146247 -0.79037 -0.395929
C  2.051666 1.927097 -0.845562
C  -5.173904 1.499584 -0.162602
C  -5.200601 -2.665071 -1.260935
C  2.487519 4.056679 -1.709786
H  -0.581441 1.185544 1.247609
H  3.811255 0.482292 -2.515478
H  3.210296 -2.769716 1.893559
H  1.679084 -3.157287 1.119964
H  3.195324 -3.705767 0.399779
H  -4.80071 2.448271 0.212769
H  -6.044662 1.206682 0.420846
H  -5.466328 1.622057 -1.203749
H  -5.008786 -3.280339 -0.381677
H  -4.425743 -2.861927 -2.002075
H  -6.176628 -2.901948 -1.673275
H  3.322719 4.553673 -2.195925
H  2.244722 4.574331 -0.781738
H  1.615262 4.083356 -2.364012
totalener: -2007.82697697 hartree
nucrepener: 2749.27725932 hartree
electener: -4757.10423630 hartree
oneelecener: -8226.26209442 hartree
twoeener: 3469.15785812 hartree
kineticenergy: 2001.59686133 hartree
xcener: -148.474834602232 hartree
chargesum: 0.0000000
charge: 0.850214 0.094817 -0.444868 -0.441379 -0.295815 -0.271285 -0.358305 -0.414172 -0.373959 -0.213080 0.014403 -0.159639 -0.303200 -0.291473 0.131711 0.033604 -0.177750 0.331381 -0.210566 0.353596 0.394663 0.445283 -0.170229 -0.122752 -0.128777 0.215238 0.131526 0.112753 0.134039 0.072737 0.124125 0.116446 0.115484 0.119626 0.118532 0.122104 0.117104 0.118678 0.109184
qa: 0.8502 0.0948 -0.4449 -0.4414 -0.2958 -0.2713 -0.3583 -0.4142 -0.3740 -0.2131 0.0144 -0.1596 -0.3032 -0.2915 0.1317 0.0336 -0.1777 0.3314 -0.2106 0.3536 0.3947 0.4453 -0.1702 -0.1228 -0.1288 0.2152 0.1315 0.1128 0.1340 0.0727 0.1241 0.1164 0.1155 0.1196 0.1185 0.1221 0.1171 0.1187 0.1092
va: 5.8732 2.7912 2.0560 2.0682 2.1197 2.1240 2.1618 2.0974 2.1137 3.1556 3.1761 3.2751 2.8346 3.8574 3.7903 3.6596 4.1056 4.4072 3.9127 4.2891 4.1074 4.0829 3.8721 3.8622 3.8880 1.0423 1.0184 1.0017 1.0063 1.0050 1.0149 0.9924 0.9926 0.9969 0.9967 0.9899 0.9936 0.9947 0.9956
dispcorr: -0.020548527 hartree
energy: -2007.847525501677
dipole: -12.71090 11.15164 -1.55926 1.67200 -1.69652 -0.02452 -8.46861 6.05560 -2.41301
magnitude: 2.87307 au
magnitude: 7.30277 debye
