program: Orca
programVersion: 5.0.2
elementType: S F F F O O O O O N N N N N N C C C C C C C C C C C C C C H H H H H H H H H H H H H
charge: 0
multiplicity: 1
keywords: wb97x-d3
keywords: def2-TZVPP
keywords: def2/J RIJCOSX
keywords: DEFGRID2
keywords: scfconv7
keywords: smallprint printgap noloewdin
keywords: NOSOSCF
formula: C14H13F3N6O5S
InChI: InChI=1/C14H13F3N6O5S/c1-26-8-6-9(27-2)23-13(19-8)20-12(21-23)22-29(24,25)10-7(14(15,16)17)4-5-18-11(10)28-3/h4-6,22H,1-3H3
42 atoms
S  2.13085 1.047501 -1.118121
F  4.427912 -0.799538 -0.143589
F  4.126687 -2.208079 1.430766
F  2.883051 -2.313581 -0.299312
O  0.819961 2.628069 0.889068
O  2.93935 2.243725 -1.247646
O  2.477842 -0.141079 -1.864412
O  -4.393532 1.490056 -1.151611
O  -4.194878 -2.945091 0.44364
N  0.610864 1.49699 -1.61151
N  -2.479894 0.347339 -0.93422
N  -1.69145 1.358918 -1.341078
N  -0.465259 -0.492158 -0.865593
N  0.90092 1.211694 2.670734
N  -2.273824 -1.882812 -0.177065
C  1.974277 0.623042 0.609024
C  2.516035 -0.516674 1.204651
C  1.219342 1.489848 1.42469
C  -0.519757 0.778585 -1.269756
C  -1.736718 -0.757538 -0.635331
C  2.19337 -0.783709 2.52654
C  3.486327 -1.46325 0.527261
C  -3.831201 0.360752 -0.806651
C  1.360639 0.090295 3.198233
C  -4.417201 -0.782825 -0.339667
C  -3.576299 -1.876139 -0.028884
C  -0.121378 3.439106 1.592804
C  -5.819079 1.577021 -1.07929
C  -3.4160 -4.071998 0.838366
H  0.47781 2.502163 -1.664305
H  2.569651 -1.650846 3.046191
H  1.062665 -0.123712 4.216628
H  -5.485157 -0.857195 -0.200588
H  -1.030268 2.883592 1.820913
H  -0.357215 4.257116 0.918597
H  0.30427 3.839564 2.511526
H  -6.073981 2.57478 -1.421684
H  -6.165667 1.44316 -0.054583
H  -6.28627 0.838175 -1.730637
H  -4.126413 -4.799354 1.221256
H  -2.707876 -3.81293 1.625104
H  -2.878016 -4.504756 -0.004373
elementType: S F O N C H
totalener: -1943.85050023 hartree
nucrepener: 3299.47221579 hartree
electener: -5243.32271602 hartree
oneelecener: -9235.75987482 hartree
twoeener: 3992.43715880 hartree
cpcmener: -0.05971055 hartree
kineticenergy: 1937.23277893 hartree
xcener: -156.763939145056 hartree
chargesum: 0.0000000
charge: 0.871671 -0.169979 -0.172788 -0.162335 -0.300393 -0.515618 -0.499391 -0.284832 -0.292692 -0.172391 0.161154 -0.383558 -0.391975 -0.373997 -0.403811 -0.138719 -0.051965 0.449844 0.240078 0.232081 -0.109786 0.542734 0.380579 0.024151 -0.284257 0.404237 -0.122551 -0.127355 -0.113963 0.198947 0.147308 0.153416 0.141717 0.115039 0.131839 0.124216 0.131938 0.131313 0.131270 0.131725 0.113255 0.113846
qa: 0.8717 -0.1700 -0.1728 -0.1623 -0.3004 -0.5156 -0.4994 -0.2848 -0.2927 -0.1724 0.1612 -0.3836 -0.3920 -0.3740 -0.4038 -0.1387 -0.0520 0.4498 0.2401 0.2321 -0.1098 0.5427 0.3806 0.0242 -0.2843 0.4042 -0.1226 -0.1274 -0.1140 0.1989 0.1473 0.1534 0.1417 0.1150 0.1318 0.1242 0.1319 0.1313 0.1313 0.1317 0.1133 0.1138
va: 5.8501 1.1347 1.1315 1.1352 2.1198 1.9727 1.9840 2.1633 2.1297 3.1212 3.3127 2.8310 2.9832 3.0091 2.9654 3.7146 3.8229 3.9306 4.3003 4.4102 3.8897 4.4423 4.0675 4.0634 3.8740 4.0365 3.8450 3.8366 3.8445 1.0159 1.0049 0.9931 1.0186 0.9983 0.9917 0.9980 0.9925 0.9855 0.9862 0.9937 0.9974 0.9963
dispcorr: -0.022450840 hartree
energy: -1943.872951072170
dipole: -39.80774 34.20997 -5.59776 7.53486 -7.06951 0.46535 8.53498 -5.55172 2.98326
magnitude: 6.36014 au
magnitude: 16.16619 debye
