program: Orca
programVersion: 5.0.2
elementType: S F F F O O O O O N N N N N N C C C C C C C C C C C C C C H H H H H H H H H H H H H
charge: 0
multiplicity: 1
keywords: wb97x-d3
keywords: def2-TZVPP
keywords: def2/J RIJCOSX
keywords: DEFGRID2
keywords: scfconv7
keywords: smallprint printgap noloewdin
keywords: NOSOSCF
formula: C14H13F3N6O5S
InChI: InChI=1/C14H13F3N6O5S/c1-26-8-6-9(27-2)23-13(19-8)20-12(21-23)22-29(24,25)10-7(14(15,16)17)4-5-18-11(10)28-3/h4-6,22H,1-3H3
42 atoms
S  2.077664 1.00781 -1.179699
F  2.853063 -2.270344 -0.08382
F  4.412059 -0.761359 -0.123391
F  4.161639 -2.017198 1.581682
O  0.898377 2.798864 0.732684
O  2.88074 2.179688 -1.466132
O  2.388773 -0.252085 -1.816864
O  -4.486484 1.115843 -1.566002
O  -4.150299 -2.980948 0.747703
N  0.539877 1.414589 -1.64106
N  -2.528938 0.170662 -1.02144
N  -1.76814 1.157875 -1.532346
N  -0.481702 -0.504541 -0.674947
N  1.004062 1.528505 2.621298
N  -2.253972 -1.895804 0.094804
C  1.999081 0.74997 0.584488
C  2.548939 -0.341224 1.25843
C  1.288749 1.698265 1.347973
C  -0.574301 0.680694 -1.281361
C  -1.749531 -0.820341 -0.499161
C  2.264444 -0.492367 2.607204
C  3.491099 -1.352713 0.637554
C  -3.884989 0.104017 -0.995965
C  1.460044 0.444809 3.225647
C  -4.438126 -0.989519 -0.388995
C  -3.561777 -1.95807 0.151459
C  0.089794 3.742463 1.43619
C  -5.915857 1.114965 -1.598216
C  -3.337886 -3.996148 1.33291
H  0.388992 2.406926 -1.78878
H  2.648096 -1.317827 3.185957
H  1.191943 0.322061 4.267002
H  -5.507534 -1.118907 -0.318607
H  0.615244 4.155078 2.295751
H  -0.850112 3.297901 1.760194
H  -0.112832 4.535383 0.722605
H  -6.291983 0.251978 -2.147942
H  -6.20218 2.025671 -2.114507
H  -6.328714 1.123973 -0.589406
H  -2.706582 -3.596513 2.12599
H  -2.714155 -4.490797 0.589284
H  -4.030987 -4.717402 1.756744
elementType: S F O N C H
totalener: -1943.85050512 hartree
nucrepener: 3285.02808669 hartree
electener: -5228.87859180 hartree
oneelecener: -9207.09699093 hartree
twoeener: 3978.21839913 hartree
cpcmener: -0.05923880 hartree
kineticenergy: 1937.22554525 hartree
xcener: -156.764228184191 hartree
chargesum: -0.0000000
charge: 0.869162 -0.162262 -0.170341 -0.173345 -0.301052 -0.515872 -0.500406 -0.284017 -0.292956 -0.175091 0.155228 -0.385695 -0.403997 -0.377216 -0.404520 -0.131604 -0.052032 0.453448 0.264312 0.232697 -0.114704 0.543147 0.379897 0.022965 -0.285791 0.404281 -0.121517 -0.126558 -0.114532 0.202218 0.148151 0.153110 0.142274 0.122419 0.116321 0.130595 0.131386 0.132064 0.130407 0.113814 0.113603 0.132012
qa: 0.8692 -0.1623 -0.1703 -0.1733 -0.3011 -0.5159 -0.5004 -0.2840 -0.2930 -0.1751 0.1552 -0.3857 -0.4040 -0.3772 -0.4045 -0.1316 -0.0520 0.4534 0.2643 0.2327 -0.1147 0.5431 0.3799 0.0230 -0.2858 0.4043 -0.1215 -0.1266 -0.1145 0.2022 0.1482 0.1531 0.1423 0.1224 0.1163 0.1306 0.1314 0.1321 0.1304 0.1138 0.1136 0.1320
va: 5.8592 1.1345 1.1343 1.1307 2.1201 1.9719 1.9841 2.1639 2.1300 3.1264 3.3133 2.8390 2.9777 3.0082 2.9651 3.7153 3.8238 3.9265 4.2834 4.4163 3.8938 4.4427 4.0709 4.0656 3.8728 4.0362 3.8501 3.8366 3.8446 1.0139 1.0044 0.9931 1.0183 0.9973 0.9970 0.9921 0.9861 0.9924 0.9859 0.9969 0.9969 0.9935
dispcorr: -0.021932009 hartree
energy: -1943.872437126998
dipole: -39.05530 33.61550 -5.43980 7.52600 -6.92825 0.59775 7.66692 -4.89522 2.77170
magnitude: 6.13442 au
magnitude: 15.59245 debye
