program: Orca
programVersion: 5.0.2
elementType: S F F F O O O O O N N N N N N C C C C C C C C C C C C C C H H H H H H H H H H H H H
charge: 0
multiplicity: 1
keywords: wb97x-d3
keywords: def2-TZVPP
keywords: def2/J RIJCOSX
keywords: DEFGRID2
keywords: scfconv7
keywords: smallprint printgap noloewdin
keywords: NOSOSCF
formula: C14H13F3N6O5S
InChI: InChI=1/C14H13F3N6O5S/c1-26-8-6-9(27-2)23-13(19-8)20-12(21-23)22-29(24,25)10-7(14(15,16)17)4-5-18-11(10)28-3/h4-6,22H,1-3H3
42 atoms
S  2.045546 1.094956 -1.102279
F  3.601758 -2.348995 1.59207
F  2.301628 -2.256131 -0.096273
F  4.150253 -1.120638 -0.062505
O  1.137223 2.978989 0.833432
O  2.839448 2.275322 -1.369038
O  2.348287 -0.142512 -1.779312
O  -4.514611 1.015854 -1.647246
O  -4.104411 -3.15409 0.521381
N  0.49434 1.51897 -1.499542
N  -2.545863 0.11923 -1.07024
N  -1.80938 1.152343 -1.524778
N  -0.489298 -0.463455 -0.638249
N  1.255335 1.752247 2.741977
N  -2.234741 -1.966341 -0.001007
C  1.991209 0.811966 0.66049
C  2.400072 -0.349502 1.318367
C  1.456616 1.855014 1.446578
C  -0.603121 0.731072 -1.230114
C  -1.745105 -0.853627 -0.533927
C  2.194021 -0.433076 2.688805
C  3.108247 -1.522051 0.663463
C  -3.897017 0.004776 -1.095098
C  1.60238 0.629211 3.343547
C  -4.431654 -1.129499 -0.546894
C  -3.538727 -2.084472 -0.006879
C  0.499371 4.014754 1.578866
C  -5.940426 0.984447 -1.704392
C  -3.267238 -4.154888 1.094353
H  0.331783 2.506249 -1.663273
H  2.479784 -1.301376 3.260852
H  1.413301 0.569862 4.408413
H  -5.497172 -1.301613 -0.520269
H  1.142687 4.39132 2.373614
H  -0.444897 3.677121 2.006014
H  0.30805 4.80952 0.862913
H  -6.292091 0.132681 -2.288041
H  -6.23912 1.904876 -2.197206
H  -6.372699 0.954107 -0.703309
H  -3.940802 -4.919129 1.473649
H  -2.672159 -3.758598 1.917508
H  -2.602426 -4.597075 0.351962
elementType: S F O N C H
totalener: -1943.85075463 hartree
nucrepener: 3279.69648122 hartree
electener: -5223.54723585 hartree
oneelecener: -9196.48301283 hartree
twoeener: 3972.93577698 hartree
cpcmener: -0.04920732 hartree
kineticenergy: 1937.19945596 hartree
xcener: -156.760165915537 hartree
chargesum: -0.0000000
charge: 0.857650 -0.176183 -0.156847 -0.166627 -0.297744 -0.501102 -0.482973 -0.274315 -0.286458 -0.175633 0.148449 -0.381992 -0.408949 -0.379558 -0.397219 -0.153366 -0.038585 0.455829 0.276766 0.231939 -0.109592 0.539586 0.374297 0.019343 -0.291230 0.397401 -0.120260 -0.129550 -0.114511 0.201605 0.144383 0.149599 0.139066 0.119350 0.114042 0.127919 0.129019 0.131602 0.128419 0.129843 0.112468 0.114121
qa: 0.8577 -0.1762 -0.1568 -0.1666 -0.2977 -0.5011 -0.4830 -0.2743 -0.2865 -0.1756 0.1484 -0.3820 -0.4089 -0.3796 -0.3972 -0.1534 -0.0386 0.4558 0.2768 0.2319 -0.1096 0.5396 0.3743 0.0193 -0.2912 0.3974 -0.1203 -0.1295 -0.1145 0.2016 0.1444 0.1496 0.1391 0.1193 0.1140 0.1279 0.1290 0.1316 0.1284 0.1298 0.1125 0.1141
va: 5.8921 1.1251 1.1422 1.1371 2.1181 1.9915 2.0087 2.1728 2.1367 3.1183 3.3192 2.8471 2.9732 3.0103 2.9683 3.7482 3.8042 3.9259 4.2761 4.4074 3.8811 4.4454 4.0754 4.0709 3.8691 4.0480 3.8573 3.8423 3.8474 1.0145 1.0067 0.9940 1.0195 0.9973 0.9973 0.9927 0.9858 0.9929 0.9862 0.9934 0.9977 0.9970
dispcorr: -0.021575409 hartree
energy: -1943.872330037786
dipole: -35.94692 30.95477 -4.99215 8.45601 -7.91158 0.54444 7.12126 -4.64645 2.47481
magnitude: 5.59845 au
magnitude: 14.23013 debye
