program: Orca
programVersion: 5.0.2
elementType: S F F F O O O O O N N N N N N C C C C C C C C C C C C C C H H H H H H H H H H H H H
charge: 0
multiplicity: 1
keywords: wb97x-d3
keywords: def2-TZVPP
keywords: def2/J RIJCOSX
keywords: DEFGRID2
keywords: scfconv7
keywords: smallprint printgap noloewdin
keywords: NOSOSCF
formula: C14H13F3N6O5S
InChI: InChI=1/C14H13F3N6O5S/c1-26-8-6-9(27-2)23-13(19-8)20-12(21-23)22-29(24,25)10-7(14(15,16)17)4-5-18-11(10)28-3/h4-6,22H,1-3H3
42 atoms
S  2.064279 1.047292 -1.176775
F  2.754055 -2.248037 -0.16125
F  4.365829 -0.794106 -0.099821
F  4.020557 -2.100939 1.550255
O  0.971079 2.863647 0.763452
O  2.849939 2.23138 -1.451279
O  2.379667 -0.201641 -1.82801
O  -4.501587 1.052283 -1.614996
O  -4.136519 -3.011464 0.753225
N  0.514932 1.449743 -1.605183
N  -2.541077 0.135181 -1.043018
N  -1.793655 1.129051 -1.56166
N  -0.487014 -0.479993 -0.642796
N  1.041526 1.572101 2.635627
N  -2.251875 -1.903811 0.116921
C  1.987502 0.771666 0.585048
C  2.486493 -0.351643 1.243635
C  1.323253 1.741575 1.362261
C  -0.589546 0.692056 -1.281166
C  -1.749305 -0.832356 -0.484452
C  2.195068 -0.509117 2.591117
C  3.401445 -1.380707 0.609864
C  -3.894971 0.054132 -1.028327
C  1.443769 0.460841 3.226315
C  -4.442296 -1.03699 -0.409733
C  -3.558411 -1.986652 0.154148
C  0.235542 3.837012 1.502237
C  -5.928533 1.049535 -1.646378
C  -3.311275 -4.007238 1.351219
H  0.356631 2.431799 -1.801941
H  2.538746 -1.361031 3.157032
H  1.173507 0.339606 4.268159
H  -5.510581 -1.18021 -0.346556
H  0.806689 4.208147 2.35269
H  -0.717457 3.439088 1.850693
H  0.054497 4.651271 0.80595
H  -6.307799 0.181039 -2.186312
H  -6.216384 1.954239 -2.17366
H  -6.343696 1.072421 -0.637939
H  -2.693186 -3.591844 2.147574
H  -2.670081 -4.493794 0.615999
H  -3.994637 -4.740036 1.772886
elementType: S F O N C H
totalener: -1943.85018948 hartree
nucrepener: 3283.94712650 hartree
electener: -5227.79731599 hartree
oneelecener: -9204.85563539 hartree
twoeener: 3977.05831940 hartree
cpcmener: -0.04945926 hartree
kineticenergy: 1937.20369355 hartree
xcener: -156.760458179817 hartree
chargesum: 0.0000000
charge: 0.857683 -0.158166 -0.168603 -0.175228 -0.296567 -0.501912 -0.483234 -0.274054 -0.286155 -0.176301 0.149119 -0.381317 -0.403945 -0.377239 -0.397534 -0.126815 -0.050867 0.445813 0.272411 0.228244 -0.115487 0.541530 0.374597 0.019363 -0.290772 0.397840 -0.121476 -0.129680 -0.114776 0.199821 0.145416 0.149729 0.139113 0.120570 0.113999 0.128812 0.129432 0.131540 0.128321 0.112980 0.113878 0.129918
qa: 0.8577 -0.1582 -0.1686 -0.1752 -0.2966 -0.5019 -0.4832 -0.2741 -0.2862 -0.1763 0.1491 -0.3813 -0.4039 -0.3772 -0.3975 -0.1268 -0.0509 0.4458 0.2724 0.2282 -0.1155 0.5415 0.3746 0.0194 -0.2908 0.3978 -0.1215 -0.1297 -0.1148 0.1998 0.1454 0.1497 0.1391 0.1206 0.1140 0.1288 0.1294 0.1315 0.1283 0.1130 0.1139 0.1299
va: 5.8843 1.1404 1.1365 1.1274 2.1236 1.9907 2.0062 2.1730 2.1370 3.1222 3.3173 2.8424 2.9789 3.0088 2.9677 3.7245 3.8203 3.9324 4.2749 4.4143 3.8921 4.4460 4.0756 4.0691 3.8701 4.0474 3.8558 3.8422 3.8476 1.0155 1.0054 0.9938 1.0195 0.9974 0.9974 0.9925 0.9859 0.9929 0.9860 0.9973 0.9972 0.9933
dispcorr: -0.021813365 hartree
energy: -1943.872002849273
dipole: -38.29667 33.14088 -5.15579 7.64195 -7.12363 0.51832 7.85081 -5.31483 2.53598
magnitude: 5.76906 au
magnitude: 14.66378 debye
