program: Orca
programVersion: 5.0.2
elementType: S F F F O O O O O N N N N N N C C C C C C C C C C C C C C H H H H H H H H H H H H H
charge: 0
multiplicity: 1
keywords: wb97x-d3
keywords: def2-TZVPP
keywords: def2/J RIJCOSX
keywords: DEFGRID2
keywords: scfconv7
keywords: smallprint printgap noloewdin
keywords: NOSOSCF
formula: C14H13F3N6O5S
InChI: InChI=1/C14H13F3N6O5S/c1-26-8-6-9(27-2)23-13(19-8)20-12(21-23)22-29(24,25)10-7(14(15,16)17)4-5-18-11(10)28-3/h4-6,22H,1-3H3
42 atoms
S  1.774649 1.663501 0.937688
F  3.68294 -2.468355 0.056355
F  3.925487 -0.677321 1.187579
F  2.095123 -1.83385 1.331683
O  1.223375 2.615625 -1.68963
O  1.921801 0.79711 2.081661
O  2.542917 2.885677 0.852162
O  -1.330563 -2.667576 0.54741
O  -5.742238 -1.146821 -0.165681
N  0.184284 2.131271 0.883067
N  -1.900892 -0.505164 0.532291
N  -0.650265 -0.06049 0.748405
N  -2.10019 1.667664 0.522942
N  1.576006 0.744992 -2.931039
N  -4.069351 0.358742 0.167671
C  1.991837 0.718424 -0.567484
C  2.459316 -0.593186 -0.655981
C  1.598071 1.352986 -1.76509
C  -0.850025 1.234135 0.729193
C  -2.77447 0.540816 0.39678
C  2.445013 -1.214138 -1.897885
C  3.033557 -1.387195 0.501828
C  -2.295785 -1.796232 0.414717
C  1.974309 -0.512802 -2.990869
C  -3.624525 -2.014819 0.170784
C  -4.468282 -0.884072 0.062205
C  0.691326 3.251332 -2.85028
C  -1.647528 -4.051163 0.402165
C  -6.648369 -0.055358 -0.295178
H  0.004875 3.084074 0.586381
H  2.788083 -2.227456 -2.036038
H  1.931114 -0.98906 -3.962826
H  -4.029164 -3.009848 0.06254
H  -0.195703 2.734534 -3.216792
H  1.43041 3.314833 -3.648358
H  0.418478 4.253568 -2.531254
H  -0.7122 -4.586654 0.535335
H  -2.045024 -4.259406 -0.592322
H  -2.359829 -4.373767 1.162412
H  -6.377944 0.596072 -1.126536
H  -6.700136 0.534748 0.620239
H  -7.620034 -0.501876 -0.489843
elementType: S F O N C H
totalener: -1943.85109717 hartree
nucrepener: 3322.12462847 hartree
electener: -5265.97572564 hartree
oneelecener: -9280.65463179 hartree
twoeener: 4014.67890615 hartree
cpcmener: -0.04870950 hartree
kineticenergy: 1937.21795955 hartree
xcener: -156.762242621200 hartree
chargesum: -0.0000000
charge: 0.856233 -0.176793 -0.165626 -0.159193 -0.298082 -0.480212 -0.497658 -0.276316 -0.286624 -0.175297 0.150566 -0.408906 -0.382169 -0.378895 -0.396825 -0.155180 -0.032708 0.449493 0.275512 0.220833 -0.113849 0.543485 0.376768 0.021796 -0.289839 0.401325 -0.119095 -0.129997 -0.113752 0.202311 0.144379 0.149665 0.139293 0.114458 0.119390 0.127970 0.129982 0.128909 0.129467 0.111686 0.113415 0.130074
qa: 0.8562 -0.1768 -0.1656 -0.1592 -0.2981 -0.4802 -0.4977 -0.2763 -0.2866 -0.1753 0.1506 -0.4089 -0.3822 -0.3789 -0.3968 -0.1552 -0.0327 0.4495 0.2755 0.2208 -0.1138 0.5435 0.3768 0.0218 -0.2898 0.4013 -0.1191 -0.1300 -0.1138 0.2023 0.1444 0.1497 0.1393 0.1145 0.1194 0.1280 0.1300 0.1289 0.1295 0.1117 0.1134 0.1301
va: 5.8908 1.1255 1.1388 1.1381 2.1164 2.0108 1.9976 2.1690 2.1367 3.1195 3.3322 2.8068 3.0238 3.0112 2.9695 3.7444 3.7894 3.9369 4.2711 4.4173 3.8831 4.4355 4.0672 4.0694 3.8770 4.0449 3.8559 3.8427 3.8476 1.0146 1.0065 0.9938 1.0193 0.9977 0.9973 0.9925 0.9933 0.9862 0.9859 0.9981 0.9972 0.9935
dispcorr: -0.022404854 hartree
energy: -1943.873502025546
dipole: -31.12725 28.38118 -2.74607 -0.22250 -2.56704 -2.78954 -15.88043 12.65055 -3.22988
magnitude: 5.07489 au
magnitude: 12.89935 debye
