program: Orca
programVersion: 5.0.2
elementType: S F F F O O O O O N N N N N N C C C C C C C C C C C C C C H H H H H H H H H H H H H
charge: 0
multiplicity: 1
keywords: wb97x-d3
keywords: def2-TZVPP
keywords: def2/J RIJCOSX
keywords: DEFGRID2
keywords: scfconv7
keywords: smallprint printgap noloewdin
keywords: NOSOSCF
formula: C14H13F3N6O5S
InChI: InChI=1/C14H13F3N6O5S/c1-26-8-6-9(27-2)23-13(19-8)20-12(21-23)22-29(24,25)10-7(14(15,16)17)4-5-18-11(10)28-3/h4-6,22H,1-3H3
42 atoms
S  1.528805 1.49257 1.384851
F  3.525681 -1.019709 1.93762
F  1.712681 -1.975047 1.216875
F  3.620936 -2.551267 0.460393
O  1.82852 2.897434 -1.064622
O  1.361441 0.440184 2.358125
O  2.237669 2.703328 1.739246
O  -1.242196 -2.644021 -0.609054
O  -5.778457 -1.339616 -0.619446
N  0.022554 1.980338 0.916851
N  -1.934152 -0.589963 -0.062501
N  -0.698638 -0.123009 0.185325
N  -2.256977 1.488258 0.518495
N  2.788534 1.317665 -2.385502
N  -4.170891 0.169076 -0.052574
C  2.265856 0.819085 -0.095812
C  2.804846 -0.460435 -0.241066
C  2.308868 1.678356 -1.215479
C  -0.973274 1.107961 0.536456
C  -2.873258 0.387786 0.129363
C  3.317402 -0.819229 -1.481285
C  2.902164 -1.49804 0.86277
C  -2.264206 -1.842932 -0.462164
C  3.27526 0.096516 -2.51397
C  -3.594291 -2.09733 -0.656666
C  -4.5066 -1.039488 -0.42784
C  1.799966 3.775738 -2.187155
C  -1.487672 -3.981739 -1.041824
C  -6.758251 -0.32799 -0.406284
H  -0.131421 2.975062 0.801229
H  3.747902 -1.790787 -1.664898
H  3.662267 -0.171537 -3.489477
H  -3.949505 -3.066394 -0.973419
H  1.365037 4.700732 -1.818217
H  1.179281 3.378682 -2.990488
H  2.801689 3.973586 -2.567836
H  -2.111148 -4.518502 -0.325669
H  -0.513823 -4.458795 -1.099591
H  -1.956132 -3.994928 -2.026872
H  -6.614428 0.5195 -1.07705
H  -6.75352 0.025747 0.625092
H  -7.71548 -0.796862 -0.619874
elementType: S F O N C H
totalener: -1943.85118253 hartree
nucrepener: 3294.79577264 hartree
electener: -5238.64695518 hartree
oneelecener: -9226.38788369 hartree
twoeener: 3987.74092851 hartree
cpcmener: -0.04788037 hartree
kineticenergy: 1937.21317945 hartree
xcener: -156.763127016734 hartree
chargesum: -0.0000000
charge: 0.848414 -0.165575 -0.157401 -0.177141 -0.296028 -0.485514 -0.497872 -0.276168 -0.286579 -0.172104 0.141812 -0.411490 -0.381153 -0.381913 -0.396805 -0.134666 -0.051063 0.455993 0.295361 0.218820 -0.115273 0.542269 0.374592 0.020154 -0.287852 0.401244 -0.119394 -0.130413 -0.114293 0.203983 0.144654 0.149430 0.139048 0.127562 0.114389 0.116574 0.129461 0.130200 0.129202 0.112684 0.112827 0.130026
qa: 0.8484 -0.1656 -0.1574 -0.1771 -0.2960 -0.4855 -0.4979 -0.2762 -0.2866 -0.1721 0.1418 -0.4115 -0.3812 -0.3819 -0.3968 -0.1347 -0.0511 0.4560 0.2954 0.2188 -0.1153 0.5423 0.3746 0.0202 -0.2879 0.4012 -0.1194 -0.1304 -0.1143 0.2040 0.1447 0.1494 0.1390 0.1276 0.1144 0.1166 0.1295 0.1302 0.1292 0.1127 0.1128 0.1300
va: 5.9039 1.1370 1.1403 1.1244 2.1207 2.0095 1.9917 2.1700 2.1365 3.1283 3.3480 2.8213 3.0347 3.0085 2.9727 3.7538 3.8226 3.9341 4.2507 4.4195 3.8795 4.4366 4.0697 4.0725 3.8776 4.0445 3.8612 3.8433 3.8477 1.0118 1.0071 0.9940 1.0194 0.9928 0.9970 0.9976 0.9856 0.9932 0.9862 0.9974 0.9975 0.9935
dispcorr: -0.021675187 hartree
energy: -1943.872857718325
dipole: -25.16188 23.60680 -1.55508 2.53697 -4.67488 -2.13791 -19.56759 15.57976 -3.98782
magnitude: 4.78452 au
magnitude: 12.16129 debye
