program: Orca
programVersion: 5.0.2
elementType: S F F F O O O O O N N N N N N C C C C C C C C C C C C C C H H H H H H H H H H H H H
charge: 0
multiplicity: 1
keywords: wb97x-d3
keywords: def2-TZVPP
keywords: def2/J RIJCOSX
keywords: DEFGRID2
keywords: scfconv7
keywords: smallprint printgap noloewdin
keywords: NOSOSCF
formula: C14H13F3N6O5S
InChI: InChI=1/C14H13F3N6O5S/c1-26-8-6-9(27-2)23-13(19-8)20-12(21-23)22-29(24,25)10-7(14(15,16)17)4-5-18-11(10)28-3/h4-6,22H,1-3H3
42 atoms
S  1.896911 1.326434 -1.059501
F  2.07499 -2.065482 -0.386697
F  4.004117 -1.063113 -0.392206
F  3.494728 -2.431529 1.163248
O  0.997204 2.957992 1.127464
O  2.639182 2.553935 -1.19225
O  2.179815 0.179426 -1.873342
O  -1.454139 -2.968626 -0.732856
O  -5.727508 -1.170439 0.17309
N  0.300723 1.745524 -1.307933
N  -1.879408 -0.769856 -0.682418
N  -0.620373 -0.403809 -0.985874
N  -1.967998 1.411318 -0.76826
N  1.429948 1.619863 2.903953
N  -3.988784 0.228303 -0.264668
C  1.925894 0.854102 0.678119
C  2.410728 -0.345881 1.19263
C  1.453638 1.811882 1.604707
C  -0.750093 0.900819 -1.023721
C  -2.693786 0.335183 -0.556935
C  2.383534 -0.531781 2.572789
C  2.993538 -1.478211 0.361295
C  -2.351647 -2.030498 -0.553568
C  1.88516 0.472467 3.374136
C  -3.682324 -2.166729 -0.261156
C  -4.450833 -0.982695 -0.121987
C  0.475342 3.914004 2.039404
C  -1.873278 -4.318205 -0.666858
C  -6.547196 -0.020964 0.322368
H  0.098045 2.726146 -1.174328
H  2.749058 -1.437894 3.027356
H  1.853482 0.348536 4.450141
H  -4.148699 -3.131559 -0.140006
H  1.227946 4.235338 2.758428
H  -0.385155 3.521615 2.581062
H  0.168658 4.75855 1.428658
H  -0.987992 -4.915994 -0.860913
H  -2.628127 -4.53884 -1.424589
H  -2.26639 -4.568049 0.320974
H  -6.585988 0.56744 -0.594487
H  -6.194602 0.622079 1.1290
H  -7.538848 -0.396863 0.559731
totalener: -1943.81697197 hartree
nucrepener: 3303.18393601 hartree
electener: -5247.00090798 hartree
oneelecener: -9241.79529409 hartree
twoeener: 3994.79438611 hartree
kineticenergy: 1937.25825975 hartree
xcener: -156.758533262075 hartree
chargesum: -0.0000000
charge: 0.835583 -0.133344 -0.149020 -0.180342 -0.287599 -0.436011 -0.409326 -0.229710 -0.267383 -0.186506 0.139859 -0.356531 -0.323992 -0.351008 -0.343367 -0.207957 -0.042413 0.448949 0.258960 0.184233 -0.104193 0.529837 0.354027 0.002539 -0.288573 0.350572 -0.118082 -0.150918 -0.118849 0.174644 0.128944 0.122084 0.114061 0.112505 0.111616 0.116491 0.132578 0.115229 0.111462 0.111796 0.109504 0.119648
qa: 0.8356 -0.1333 -0.1490 -0.1803 -0.2876 -0.4360 -0.4093 -0.2297 -0.2674 -0.1865 0.1399 -0.3565 -0.3240 -0.3510 -0.3434 -0.2080 -0.0424 0.4489 0.2590 0.1842 -0.1042 0.5298 0.3540 0.0025 -0.2886 0.3506 -0.1181 -0.1509 -0.1188 0.1746 0.1289 0.1221 0.1141 0.1125 0.1116 0.1165 0.1326 0.1152 0.1115 0.1118 0.1095 0.1196
va: 5.9117 1.1747 1.1619 1.1156 2.1221 2.0682 2.0849 2.2010 2.1421 3.1174 3.3149 2.7592 3.0406 3.0325 2.9865 3.8172 3.8315 3.8894 4.2066 4.4196 3.8584 4.4626 4.0532 4.0918 3.8696 4.1073 3.8817 3.8801 3.8687 1.0383 1.0155 0.9998 1.0284 0.9999 0.9991 0.9940 0.9960 0.9870 0.9857 0.9994 0.9997 0.9922
dispcorr: -0.021859625 hartree
energy: -1943.838831591408
dipole: -32.00738 29.72662 -2.28076 3.73822 -5.07822 -1.34000 10.12322 -8.12261 2.00061
magnitude: 3.31661 au
magnitude: 8.43016 debye
