program: Orca
programVersion: 5.0.2
elementType: S F F F O O O O O N N N N N N C C C C C C C C C C C C C C H H H H H H H H H H H H H
charge: 0
multiplicity: 1
keywords: wb97x-d3
keywords: def2-TZVPP
keywords: def2/J RIJCOSX
keywords: DEFGRID2
keywords: scfconv7
keywords: smallprint printgap noloewdin
keywords: NOSOSCF
formula: C14H13F3N6O5S
InChI: InChI=1/C14H13F3N6O5S/c1-26-8-6-9(27-2)23-13(19-8)20-12(21-23)22-29(24,25)10-7(14(15,16)17)4-5-18-11(10)28-3/h4-6,22H,1-3H3
42 atoms
S  1.758578 1.657575 0.953051
F  3.64524 -2.4731 0.007132
F  3.923461 -0.702534 1.165777
F  2.061968 -1.816157 1.276888
O  1.154224 2.629838 -1.6856
O  1.920307 0.776517 2.074601
O  2.491242 2.893805 0.848611
O  -1.383055 -2.724948 0.565016
O  -5.78916 -1.172887 -0.14001
N  0.150849 2.089921 0.885277
N  -1.928913 -0.55232 0.50672
N  -0.675619 -0.109085 0.721407
N  -2.124903 1.625235 0.497516
N  1.661467 0.825159 -2.958961
N  -4.103033 0.323264 0.152402
C  1.9764 0.735726 -0.577077
C  2.477819 -0.558082 -0.685584
C  1.6017 1.387795 -1.773269
C  -0.87205 1.188901 0.709819
C  -2.802903 0.505827 0.372167
C  2.538723 -1.139101 -1.949746
C  3.017767 -1.381459 0.473088
C  -2.338106 -1.837873 0.421057
C  2.111367 -0.4140 -3.040874
C  -3.67183 -2.051235 0.194975
C  -4.508913 -0.912995 0.071945
C  0.793548 3.303604 -2.883314
C  -1.730255 -4.095182 0.500737
C  -6.675748 -0.070242 -0.258697
H  -0.038307 3.038157 0.594984
H  2.917892 -2.137482 -2.094912
H  2.141374 -0.849055 -4.03296
H  -4.090932 -3.041546 0.113428
H  -0.033862 2.807634 -3.390858
H  1.634937 3.374898 -3.571878
H  0.489846 4.299817 -2.574212
H  -0.806536 -4.645915 0.649727
H  -2.151702 -4.355734 -0.472784
H  -2.438886 -4.365444 1.286357
H  -6.412032 0.569073 -1.10136
H  -6.682705 0.538858 0.64543
H  -7.660368 -0.501357 -0.418598
totalener: -1943.81694409 hartree
nucrepener: 3313.13797579 hartree
electener: -5256.95491988 hartree
oneelecener: -9261.66168239 hartree
twoeener: 4004.70676252 hartree
kineticenergy: 1937.26111195 hartree
xcener: -156.761624558378 hartree
chargesum: 0.0000000
charge: 0.835809 -0.180826 -0.149943 -0.135808 -0.284172 -0.415014 -0.437749 -0.233987 -0.267526 -0.185087 0.124384 -0.362615 -0.319643 -0.350480 -0.343202 -0.186378 -0.031858 0.433922 0.275850 0.185747 -0.106296 0.530334 0.356871 -0.000193 -0.288712 0.350215 -0.119772 -0.150503 -0.118066 0.173647 0.126819 0.121373 0.113894 0.109075 0.112189 0.118045 0.130507 0.112397 0.115803 0.109387 0.112042 0.119521
qa: 0.8358 -0.1808 -0.1499 -0.1358 -0.2842 -0.4150 -0.4377 -0.2340 -0.2675 -0.1851 0.1244 -0.3626 -0.3196 -0.3505 -0.3432 -0.1864 -0.0319 0.4339 0.2758 0.1857 -0.1063 0.5303 0.3569 -0.0002 -0.2887 0.3502 -0.1198 -0.1505 -0.1181 0.1736 0.1268 0.1214 0.1139 0.1091 0.1122 0.1180 0.1305 0.1124 0.1158 0.1094 0.1120 0.1195
va: 5.9117 1.1151 1.1614 1.1720 2.1246 2.0835 2.0653 2.1973 2.1426 3.1320 3.3604 2.7906 3.0478 3.0299 2.9876 3.8095 3.8238 3.9016 4.2065 4.4203 3.8643 4.4615 4.0484 4.0928 3.8698 4.1090 3.8833 3.8798 3.8681 1.0369 1.0153 0.9998 1.0285 0.9989 1.0003 0.9936 0.9963 0.9857 0.9869 0.9998 0.9994 0.9922
dispcorr: -0.022096284 hartree
energy: -1943.839040376437
dipole: -30.62655 28.62751 -1.99904 -0.00442 -1.87436 -1.87878 -15.43158 13.31807 -2.11350
magnitude: 3.46307 au
magnitude: 8.80243 debye
