program: Orca
programVersion: 5.0.2
elementType: S F F F O O O O O N N N N N N C C C C C C C C C C C C C C H H H H H H H H H H H H H
charge: 0
multiplicity: 1
keywords: wb97x-d3
keywords: def2-TZVPP
keywords: def2/J RIJCOSX
keywords: DEFGRID2
keywords: scfconv7
keywords: smallprint printgap noloewdin
keywords: NOSOSCF
formula: C14H13F3N6O5S
InChI: InChI=1/C14H13F3N6O5S/c1-26-8-6-9(27-2)23-13(19-8)20-12(21-23)22-29(24,25)10-7(14(15,16)17)4-5-18-11(10)28-3/h4-6,22H,1-3H3
42 atoms
S  1.942653 1.354348 -1.114863
F  3.899568 -2.25239 1.006352
F  2.659349 -2.102076 -0.721809
F  4.253232 -0.67035 -0.383189
O  0.604868 2.636005 1.121697
O  2.699112 2.579928 -1.07728
O  2.282141 0.263711 -1.986486
O  -1.797971 -2.938891 -0.963473
O  -5.683421 -0.782099 0.39369
N  0.378347 1.820232 -1.488389
N  -1.906518 -0.602522 -0.816899
N  -0.664701 -0.281992 -1.240206
N  -1.85792 1.587672 -0.776149
N  0.745558 1.013177 2.698321
N  -3.894733 0.512553 -0.148192
C  1.792057 0.69967 0.557969
C  2.343201 -0.502066 0.99786
C  1.040893 1.446358 1.49264
C  -0.708433 1.027911 -1.181785
C  -2.632792 0.544967 -0.554447
C  2.047151 -0.932257 2.288463
C  3.292358 -1.376955 0.193881
C  -2.451428 -1.838832 -0.677521
C  1.226525 -0.15545 3.079506
C  -3.753121 -1.888318 -0.254476
C  -4.429433 -0.672988 -0.010683
C  -0.336843 3.304096 1.95336
C  -0.376787 -3.066664 -0.831005
C  -6.398923 0.413164 0.668291
H  0.210163 2.803962 -1.326273
H  2.447279 -1.851791 2.684361
H  0.958029 -0.484089 4.076511
H  -4.241624 -2.840667 -0.117624
H  0.084098 3.530625 2.93171
H  -1.241951 2.710483 2.077147
H  -0.579061 4.225773 1.432711
H  -0.025988 -2.649787 0.112574
H  0.146719 -2.587995 -1.651992
H  -0.192321 -4.137339 -0.840174
H  -6.476442 1.047618 -0.214535
H  -5.928955 0.988719 1.466154
H  -7.390254 0.096271 0.980588
totalener: -1943.81316062 hartree
nucrepener: 3363.95402085 hartree
electener: -5307.76718147 hartree
oneelecener: -9362.20518925 hartree
twoeener: 4054.43800778 hartree
kineticenergy: 1937.25321069 hartree
xcener: -156.756638113960 hartree
chargesum: -0.0000000
charge: 0.837602 -0.173372 -0.150944 -0.145548 -0.282920 -0.435999 -0.418747 -0.266092 -0.263914 -0.179831 0.155007 -0.381849 -0.324712 -0.337061 -0.347785 -0.123952 -0.119609 0.412663 0.225624 0.196566 -0.100904 0.543509 0.317741 0.002971 -0.277491 0.379540 -0.119261 -0.104599 -0.118601 0.170645 0.130344 0.124729 0.131031 0.118739 0.113351 0.118745 0.092844 0.139911 0.121278 0.111913 0.107741 0.120697
qa: 0.8376 -0.1734 -0.1509 -0.1455 -0.2829 -0.4360 -0.4187 -0.2661 -0.2639 -0.1798 0.1550 -0.3818 -0.3247 -0.3371 -0.3478 -0.1240 -0.1196 0.4127 0.2256 0.1966 -0.1009 0.5435 0.3177 0.0030 -0.2775 0.3795 -0.1193 -0.1046 -0.1186 0.1706 0.1303 0.1247 0.1310 0.1187 0.1134 0.1187 0.0928 0.1399 0.1213 0.1119 0.1077 0.1207
va: 5.8855 1.1240 1.1422 1.1704 2.1339 2.0666 2.0731 2.1664 2.1471 3.1223 3.2621 2.7326 3.0112 3.0317 2.9782 3.7233 3.8383 3.9416 4.2399 4.3900 3.8359 4.4321 4.0938 4.0880 3.9024 4.0312 3.8694 3.8440 3.8687 1.0394 1.0147 0.9988 1.0231 0.9996 0.9994 0.9944 0.9943 0.9959 0.9939 0.9988 0.9997 0.9924
dispcorr: -0.025218410 hartree
energy: -1943.838379026333
dipole: -31.03836 29.21153 -1.82683 5.51484 -6.31582 -0.80098 10.92995 -8.94388 1.98606
magnitude: 2.81484 au
magnitude: 7.15475 debye
