program: Orca
programVersion: 5.0.2
elementType: S F F F O O O O O N N N N N N C C C C C C C C C C C C C C H H H H H H H H H H H H H
charge: 0
multiplicity: 1
keywords: wb97x-d3
keywords: def2-TZVPP
keywords: def2/J RIJCOSX
keywords: DEFGRID2
keywords: scfconv7
keywords: smallprint printgap noloewdin
keywords: NOSOSCF
formula: C14H13F3N6O5S
InChI: InChI=1/C14H13F3N6O5S/c1-26-8-6-9(27-2)23-13(19-8)20-12(21-23)22-29(24,25)10-7(14(15,16)17)4-5-18-11(10)28-3/h4-6,22H,1-3H3
42 atoms
S  1.843798 1.294496 -1.168538
F  2.851526 -2.099911 -0.737336
F  4.286513 -0.472297 -0.654866
F  4.295932 -2.006947 0.833077
O  0.649188 2.584512 1.173584
O  2.623305 2.502886 -1.254924
O  2.064889 0.158007 -2.020696
O  -1.84199 -2.955628 -0.495532
O  -5.886629 -0.78668 0.187353
N  0.267119 1.783407 -1.404433
N  -2.007791 -0.617022 -0.638945
N  -0.736639 -0.303577 -0.973408
N  -2.01202 1.565531 -0.853135
N  1.024153 1.000017 2.753784
N  -4.077485 0.501366 -0.303791
C  1.874621 0.698295 0.529024
C  2.547472 -0.45049 0.936922
C  1.177571 1.423221 1.518843
C  -0.818688 1.000439 -1.083017
C  -2.781564 0.530088 -0.581924
C  2.399666 -0.873131 2.255027
C  3.494483 -1.25689 0.063254
C  -2.5358 -1.846692 -0.415897
C  1.60631 -0.132147 3.105856
C  -3.875004 -1.891262 -0.123659
C  -4.597548 -0.680261 -0.089551
C  -0.196629 3.250321 2.102259
C  -0.412488 -3.032558 -0.440506
C  -6.659143 0.403915 0.214744
H  0.11569 2.774848 -1.280703
H  2.897675 -1.755154 2.625099
H  1.449218 -0.455827 4.127849
H  -4.356762 -2.837856 0.066002
H  0.344681 3.534572 3.003729
H  -1.048909 2.630215 2.379002
H  -0.548242 4.139688 1.58741
H  0.050489 -2.645255 -1.342995
H  -0.202549 -4.093563 -0.338202
H  -0.014708 -2.500185 0.42232
H  -6.304208 1.097894 0.977093
H  -7.673119 0.090588 0.448503
H  -6.645086 0.914836 -0.74825
totalener: -1943.81380704 hartree
nucrepener: 3340.97389049 hartree
electener: -5284.78769752 hartree
oneelecener: -9316.30823152 hartree
twoeener: 4031.52053400 hartree
kineticenergy: 1937.24606696 hartree
xcener: -156.758392049859 hartree
chargesum: 0.0000000
charge: 0.840470 -0.149937 -0.146531 -0.172846 -0.285502 -0.436988 -0.420127 -0.259861 -0.264633 -0.179913 0.138261 -0.391913 -0.319862 -0.339088 -0.347241 -0.114051 -0.119238 0.413580 0.243709 0.190406 -0.105787 0.541095 0.324632 0.001751 -0.281851 0.381391 -0.118266 -0.105964 -0.118209 0.171831 0.130719 0.125244 0.129823 0.118694 0.110574 0.119424 0.138704 0.121666 0.096448 0.107900 0.120231 0.111255
qa: 0.8405 -0.1499 -0.1465 -0.1728 -0.2855 -0.4370 -0.4201 -0.2599 -0.2646 -0.1799 0.1383 -0.3919 -0.3199 -0.3391 -0.3472 -0.1141 -0.1192 0.4136 0.2437 0.1904 -0.1058 0.5411 0.3246 0.0018 -0.2819 0.3814 -0.1183 -0.1060 -0.1182 0.1718 0.1307 0.1252 0.1298 0.1187 0.1106 0.1194 0.1387 0.1217 0.0964 0.1079 0.1202 0.1113
va: 5.8887 1.1447 1.1684 1.1258 2.1320 2.0656 2.0694 2.1785 2.1454 3.1482 3.2969 2.7403 3.0220 3.0364 2.9812 3.7129 3.8431 3.9395 4.2367 4.4094 3.8487 4.4383 4.0941 4.0905 3.8908 4.0323 3.8702 3.8480 3.8692 1.0378 1.0138 0.9988 1.0238 0.9989 1.0006 0.9946 0.9951 0.9924 0.9930 0.9994 0.9922 0.9992
dispcorr: -0.024528482 hartree
energy: -1943.838335518294
dipole: -31.41100 29.83321 -1.57779 5.08462 -5.82258 -0.73797 11.66575 -9.58077 2.08498
magnitude: 2.71683 au
magnitude: 6.90562 debye
