program: Orca
programVersion: 5.0.2
elementType: S F F F O O O O O N N N N N N C C C C C C C C C C C C C C H H H H H H H H H H H H H
charge: 0
multiplicity: 1
keywords: wb97x-d3
keywords: def2-TZVPP
keywords: def2/J RIJCOSX
keywords: DEFGRID2
keywords: scfconv7
keywords: smallprint printgap noloewdin
keywords: NOSOSCF
formula: C14H13F3N6O5S
InChI: InChI=1/C14H13F3N6O5S/c1-26-8-6-9(27-2)23-13(19-8)20-12(21-23)22-29(24,25)10-7(14(15,16)17)4-5-18-11(10)28-3/h4-6,22H,1-3H3
42 atoms
S  1.838498 1.145579 1.266093
F  4.308803 -0.449739 0.547572
F  2.953291 -2.144841 0.406075
F  4.400151 -1.76911 -1.125012
O  0.58422 2.667983 -0.911669
O  2.072045 -0.074513 1.989524
O  2.608693 2.34129 1.493438
O  -1.827859 -2.981222 0.082211
O  -5.901802 -0.759566 -0.313952
N  0.25929 1.590287 1.559985
N  -2.035624 -0.709073 0.577233
N  -0.752068 -0.436878 0.895244
N  -2.029003 1.431011 1.045487
N  0.991814 1.287222 -2.6635
N  -4.099092 0.445471 0.371239
C  1.865849 0.75432 -0.492213
C  2.571586 -0.313255 -1.038621
C  1.1411 1.568091 -1.388571
C  -0.829882 0.844485 1.171676
C  -2.804682 0.436287 0.665241
C  2.42494 -0.587383 -2.394974
C  3.556925 -1.174291 -0.271331
C  -2.564074 -1.89934 0.19574
C  1.601304 0.220716 -3.149352
C  -3.898259 -1.906904 -0.108675
C  -4.616772 -0.693348 -0.008443
C  -0.229416 3.446677 -1.778571
C  -0.795928 -3.297311 1.028019
C  -6.670603 0.429458 -0.209487
H  0.101415 2.588247 1.55859
H  2.944171 -1.407212 -2.865501
H  1.442772 0.013157 -4.200905
H  -4.382363 -2.823004 -0.409714
H  -1.081242 2.875036 -2.146035
H  0.338712 3.822347 -2.628907
H  -0.582694 4.277538 -1.174921
H  -0.63564 -4.366714 0.921347
H  -1.113599 -3.084016 2.048701
H  0.121716 -2.755166 0.820179
H  -7.683135 0.150014 -0.488156
H  -6.305507 1.204953 -0.883447
H  -6.66438 0.825919 0.805987
totalener: -1943.81475335 hartree
nucrepener: 3323.97254958 hartree
electener: -5267.78730294 hartree
oneelecener: -9282.63131965 hartree
twoeener: 4014.84401671 hartree
kineticenergy: 1937.24915190 hartree
xcener: -156.757655179915 hartree
chargesum: -0.0000000
charge: 0.838480 -0.148417 -0.149305 -0.172637 -0.286519 -0.421503 -0.437334 -0.275420 -0.264325 -0.179256 0.138284 -0.389262 -0.319565 -0.343083 -0.344619 -0.131771 -0.077300 0.416619 0.251667 0.191743 -0.103298 0.534053 0.312339 0.002066 -0.275974 0.381471 -0.118955 -0.112754 -0.117728 0.171974 0.126356 0.122800 0.131180 0.111089 0.117539 0.118991 0.117767 0.116237 0.128436 0.120255 0.108720 0.110959
qa: 0.8385 -0.1484 -0.1493 -0.1726 -0.2865 -0.4215 -0.4373 -0.2754 -0.2643 -0.1793 0.1383 -0.3893 -0.3196 -0.3431 -0.3446 -0.1318 -0.0773 0.4166 0.2517 0.1917 -0.1033 0.5341 0.3123 0.0021 -0.2760 0.3815 -0.1190 -0.1128 -0.1177 0.1720 0.1264 0.1228 0.1312 0.1111 0.1175 0.1190 0.1178 0.1162 0.1284 0.1203 0.1087 0.1110
va: 5.8916 1.1657 1.1446 1.1268 2.1303 2.0692 2.0639 2.1474 2.1465 3.1483 3.3056 2.7600 3.0236 3.0333 2.9844 3.7345 3.8627 3.9367 4.2262 4.4069 3.8805 4.4421 4.0959 4.0932 3.9135 4.0201 3.8725 3.8456 3.8687 1.0379 1.0145 0.9994 1.0228 1.0002 0.9994 0.9946 0.9921 0.9930 0.9902 0.9923 0.9991 0.9994
dispcorr: -0.023462556 hartree
energy: -1943.838215909828
dipole: -32.96122 31.12201 -1.83921 5.31504 -5.93218 -0.61714 -7.89000 6.17088 -1.71911
magnitude: 2.59209 au
magnitude: 6.58856 debye
