program: Orca
programVersion: 5.0.2
elementType: Cl S O O O O N N C C C C C C C C C C C C C H H H H H H H H H H H
charge: 0
multiplicity: 1
keywords: wb97x-d3
keywords: def2-TZVPP
keywords: def2/J RIJCOSX
keywords: DEFGRID2
keywords: scfconv7
keywords: smallprint printgap noloewdin
keywords: NOSOSCF
formula: C13H11ClN2O4S
InChI: InChI=1/C13H11ClN2O4S/c1-19-9-6-10(20-2)16-13(15-9)21-8-5-3-4-7(14)11(8)12(17)18/h3-6,17H,1-2H3
32 atoms
Cl -3.907559 0.941757 -1.301668
S  0.50823 -2.04175 -0.198512
O  4.795891 0.272479 -0.0261
O  1.080381 2.521239 1.626715
O  -1.09913 -0.890934 -2.84328
O  -0.669218 1.085558 -1.882498
N  2.739404 -0.739602 -0.062489
N  0.864801 0.389662 0.828834
C  -1.131464 -1.500506 0.195527
C  -1.793867 -0.597599 -0.635835
C  -1.756997 -2.001516 1.32665
C  -3.07293 -0.187214 -0.291482
C  -3.047071 -1.597173 1.637858
C  -3.710199 -0.686513 0.833872
C  1.462166 -0.623304 0.247343
C  3.499005 0.307191 0.239277
C  1.6298 1.443539 1.087623
C  2.989523 1.463081 0.817271
C  -1.119799 -0.030592 -1.844101
C  5.347804 -0.891648 -0.635378
C  -0.332076 2.538132 1.826812
H  -1.235056 -2.698121 1.968239
H  -3.538321 -1.988655 2.517771
H  -4.713616 -0.366367 1.078472
H  3.609836 2.3208 1.033877
H  5.229817 -1.771929 -0.004222
H  6.406766 -0.682353 -0.759998
H  4.905364 -1.085323 -1.612135
H  -0.64584 1.794138 2.5585
H  -0.87227 2.37495 0.893679
H  -0.561996 3.530284 2.205715
H  -0.63913 -0.51196 -3.611018
elementType: Cl S O N C H
totalener: -1770.93423600 hartree
nucrepener: 2000.05517922 hartree
electener: -3770.98941522 hartree
oneelecener: -6409.37990900 hartree
twoeener: 2638.39049378 hartree
cpcmener: -0.03366131 hartree
kineticenergy: 1765.98119173 hartree
xcener: -125.428854583670 hartree
chargesum: -0.0000000
charge: -0.066638 -0.037038 -0.302730 -0.304499 -0.270144 -0.417833 -0.399016 -0.404036 0.073339 -0.012561 -0.130650 0.080744 -0.140798 -0.143030 0.230175 0.437172 0.413694 -0.326906 0.366014 -0.111398 -0.104404 0.140751 0.165698 0.147523 0.144031 0.112531 0.130735 0.112045 0.111347 0.099624 0.134222 0.272036
qa: -0.0666 -0.0370 -0.3027 -0.3045 -0.2701 -0.4178 -0.3990 -0.4040 0.0733 -0.0126 -0.1306 0.0807 -0.1408 -0.1430 0.2302 0.4372 0.4137 -0.3269 0.3660 -0.1114 -0.1044 0.1408 0.1657 0.1475 0.1440 0.1125 0.1307 0.1120 0.1113 0.0996 0.1342 0.2720
va: 1.2568 2.4154 2.1132 2.1138 2.2193 2.0437 2.9638 2.9550 3.7850 3.6658 4.0052 3.8892 3.9324 3.9964 4.2464 3.9825 4.0145 3.9439 4.2916 3.8443 3.8496 1.0061 0.9851 1.0029 1.0164 0.9964 0.9936 0.9969 0.9953 1.0016 0.9953 0.9811
dispcorr: -0.016833803 hartree
energy: -1770.951069805648
dipole: 13.05395 -13.51571 -0.46175 0.15534 -1.00069 -0.84535 8.35785 -7.72444 0.63341
magnitude: 1.15284 au
magnitude: 2.93029 debye
