program: Orca
programVersion: 5.0.2
elementType: Cl S O O O O N N C C C C C C C C C C C C C H H H H H H H H H H H
charge: 0
multiplicity: 1
keywords: wb97x-d3
keywords: def2-TZVPP
keywords: def2/J RIJCOSX
keywords: DEFGRID2
keywords: scfconv7
keywords: smallprint printgap noloewdin
keywords: NOSOSCF
formula: C13H11ClN2O4S
InChI: InChI=1/C13H11ClN2O4S/c1-19-9-6-10(20-2)16-13(15-9)21-8-5-3-4-7(14)11(8)12(17)18/h3-6,17H,1-2H3
32 atoms
Cl -2.738121 -2.229859 -2.534092
S  -0.821639 1.063068 1.32987
O  3.368706 -1.129036 -0.140363
O  3.526834 3.245773 1.413721
O  -0.625352 0.706797 -1.956857
O  -2.830639 1.015468 -1.728896
N  1.451118 -0.089272 0.540279
N  1.528818 2.135685 1.327811
C  -1.321054 -0.549317 0.791883
C  -1.766138 -0.727712 -0.515218
C  -1.322039 -1.608512 1.687296
C  -2.199574 -1.985775 -0.909021
C  -1.753824 -2.858233 1.27206
C  -2.191865 -3.05433 -0.027686
C  0.917137 1.009222 1.019888
C  2.763734 -0.056348 0.340381
C  2.840462 2.153746 1.124975
C  3.535105 1.062847 0.617799
C  -1.815679 0.42981 -1.462759
C  2.584661 -2.28462 -0.422979
C  2.830649 4.377561 1.926486
H  -0.985417 -1.456929 2.703939
H  -1.752164 -3.6890 1.964598
H  -2.528596 -4.029812 -0.351198
H  4.603188 1.083575 0.454452
H  1.826523 -2.084241 -1.180877
H  2.099431 -2.673609 0.472734
H  3.282201 -3.027483 -0.801931
H  3.587266 5.143527 2.077351
H  2.348206 4.158701 2.879419
H  2.083754 4.74644 1.222844
H  -0.672709 1.476855 -2.548035
elementType: Cl S O N C H
totalener: -1770.94054195 hartree
nucrepener: 1978.66771128 hartree
electener: -3749.60825323 hartree
oneelecener: -6365.83407178 hartree
twoeener: 2616.22581855 hartree
cpcmener: -0.02946603 hartree
kineticenergy: 1765.99852781 hartree
xcener: -125.429587052396 hartree
chargesum: -0.0000000
charge: -0.063300 -0.050562 -0.295663 -0.294279 -0.257160 -0.397055 -0.408566 -0.392512 0.106602 -0.003487 -0.135129 0.067113 -0.143193 -0.139654 0.232972 0.406495 0.431691 -0.323670 0.332358 -0.113031 -0.111948 0.138328 0.162049 0.145466 0.141194 0.109345 0.110046 0.131351 0.128910 0.111807 0.111229 0.262251
qa: -0.0633 -0.0506 -0.2957 -0.2943 -0.2572 -0.3971 -0.4086 -0.3925 0.1066 -0.0035 -0.1351 0.0671 -0.1432 -0.1397 0.2330 0.4065 0.4317 -0.3237 0.3324 -0.1130 -0.1119 0.1383 0.1620 0.1455 0.1412 0.1093 0.1100 0.1314 0.1289 0.1118 0.1112 0.2623
va: 1.2614 2.3915 2.1244 2.1227 2.2012 2.0878 2.9530 2.9614 3.7692 3.6767 3.9985 3.9250 3.9279 3.9863 4.2308 4.0298 3.9907 3.9373 4.3433 3.8597 3.8478 1.0041 0.9866 1.0032 1.0173 0.9946 0.9936 0.9953 0.9937 0.9967 0.9972 0.9884
dispcorr: -0.016144020 hartree
energy: -1770.956685969895
dipole: 16.11979 -14.73320 1.38659 2.82112 -3.83689 -1.01577 9.45424 -8.88230 0.57193
magnitude: 1.81150 au
magnitude: 4.60447 debye
